program: Orca
programVersion: 5.0.2
elementType: S S P O O O O N C C C C C C C C C C C H H H H H H H H H H H H
charge: 0
multiplicity: 1
keywords: wb97x-d3
keywords: def2-TZVPP
keywords: def2/J RIJCOSX
keywords: DEFGRID2
keywords: scfconv7
keywords: smallprint printgap noloewdin
keywords: NOSOSCF
formula: C11H12NO4PS2
InChI: InChI=1/C11H12NO4PS2/c1-15-17(18,16-2)19-7-12-10(13)8-5-3-4-6-9(8)11(12)14/h3-6H,7H2,1-2H3
31 atoms
S  -2.002213 -1.529579 0.641676
S  -3.319528 -0.07203 -2.015863
P  -1.855402 -0.019553 -0.773616
O  1.094212 -2.654242 0.511028
O  0.494848 1.573702 2.109124
O  -0.383879 -0.248941 -1.358836
O  -1.638221 1.350371 0.024775
N  0.487282 -0.644647 1.455754
C  2.399599 -0.636815 0.192609
C  2.213378 0.646026 0.680672
C  1.295974 -1.480431 0.690286
C  0.984542 0.657159 1.498485
C  -0.797974 -1.025651 1.943498
C  3.456777 -0.950839 -0.632765
C  3.075879 1.67387 0.367777
C  4.333546 0.081259 -0.960816
C  4.146811 1.369804 -0.469513
C  0.187097 0.67025 -2.302495
C  -2.72469 1.998705 0.692504
H  -0.732357 -1.900555 2.589235
H  -1.21546 -0.209057 2.525461
H  3.601387 -1.951501 -1.01705
H  2.928483 2.676552 0.746093
H  5.173414 -0.120601 -1.611343
H  4.844615 2.148349 -0.746147
H  0.494197 1.592205 -1.811046
H  -0.515435 0.901147 -3.103628
H  1.059244 0.178806 -2.726043
H  -3.522138 2.244017 -0.00853
H  -2.327118 2.91497 1.120168
H  -3.125874 1.373728 1.491406
elementType: S P O N C H
totalener: -1920.01715917 hartree
nucrepener: 2028.85507908 hartree
electener: -3948.87223825 hartree
oneelecener: -6676.99335438 hartree
twoeener: 2728.12111613 hartree
cpcmener: -0.03754281 hartree
kineticenergy: 1914.72175186 hartree
xcener: -128.577074612859 hartree
chargesum: 0.0000000
charge: -0.142483 -0.433474 0.603786 -0.417293 -0.428804 -0.332982 -0.317869 -0.075508 -0.048563 -0.007218 0.350002 0.305534 -0.048344 -0.137596 -0.116452 -0.115190 -0.109284 -0.115464 -0.114010 0.167954 0.147658 0.155057 0.154861 0.166777 0.166957 0.124928 0.124506 0.126134 0.120302 0.128724 0.117352
qa: -0.1425 -0.4335 0.6038 -0.4173 -0.4288 -0.3330 -0.3179 -0.0755 -0.0486 -0.0072 0.3500 0.3055 -0.0483 -0.1376 -0.1165 -0.1152 -0.1093 -0.1155 -0.1140 0.1680 0.1477 0.1551 0.1549 0.1668 0.1670 0.1249 0.1245 0.1261 0.1203 0.1287 0.1174
va: 2.2749 2.0521 5.4559 2.0973 2.0774 2.0716 2.0650 3.1060 3.5535 3.5471 4.1634 4.1863 3.9058 3.9745 3.9577 3.9021 3.8938 3.8369 3.8431 0.9935 1.0152 1.0027 1.0025 0.9875 0.9871 0.9887 1.0068 0.9864 1.0061 0.9909 0.9868
dispcorr: -0.019433464 hartree
energy: -1920.036592634407
dipole: 8.00736 -5.40112 2.60625 9.77860 -7.99945 1.77915 -1.33489 1.80734 0.47245
magnitude: 3.19078 au
magnitude: 8.11033 debye
