program: Orca
programVersion: 5.0.2
elementType: S S P O O O O N C C C C C C C C C C C H H H H H H H H H H H H
charge: 0
multiplicity: 1
keywords: wb97x-d3
keywords: def2-TZVPP
keywords: def2/J RIJCOSX
keywords: DEFGRID2
keywords: scfconv7
keywords: smallprint printgap noloewdin
keywords: NOSOSCF
formula: C11H12NO4PS2
InChI: InChI=1/C11H12NO4PS2/c1-15-17(18,16-2)19-7-12-10(13)8-5-3-4-6-9(8)11(12)14/h3-6H,7H2,1-2H3
31 atoms
S  -1.769923 0.049666 -1.782966
S  -3.661188 1.309469 0.589663
P  -2.183023 0.132764 0.247777
O  0.693832 -2.300224 0.542189
O  1.382166 0.945312 -2.580597
O  -0.815258 0.499389 1.004874
O  -2.330695 -1.409815 0.630612
N  0.782642 -0.810465 -1.220343
C  2.348316 -0.53613 0.429005
C  2.564208 0.449047 -0.521243
C  1.194027 -1.349063 -0.002185
C  1.552321 0.288974 -1.584311
C  -0.412443 -1.186589 -1.903317
C  3.129388 -0.63666 1.559702
C  3.569377 1.381293 -0.382755
C  4.148332 0.301575 1.711683
C  4.363624 1.292641 0.758644
C  -0.348635 1.849923 1.075997
C  -2.456128 -1.81088 2.005136
H  -0.230468 -1.278389 -2.97336
H  -0.752789 -2.151968 -1.53978
H  2.960352 -1.405169 2.30188
H  3.736631 2.152906 -1.122151
H  4.782558 0.261645 2.586797
H  5.161715 2.006735 0.909287
H  -1.088205 2.493174 1.552923
H  -0.117537 2.242081 0.084268
H  0.557747 1.835454 1.675855
H  -2.816713 -2.83537 1.9976
H  -3.174214 -1.185625 2.536828
H  -1.492861 -1.769514 2.510543
elementType: S P O N C H
totalener: -1920.02037780 hartree
nucrepener: 2007.46689010 hartree
electener: -3927.48726790 hartree
oneelecener: -6634.12347726 hartree
twoeener: 2706.63620936 hartree
cpcmener: -0.03624527 hartree
kineticenergy: 1914.71053591 hartree
xcener: -128.574549214704 hartree
chargesum: 0.0000000
charge: -0.137252 -0.435832 0.609340 -0.428029 -0.423688 -0.323849 -0.339245 -0.055548 -0.005563 -0.058100 0.301100 0.341231 -0.064861 -0.113575 -0.111288 -0.116431 -0.115862 -0.123142 -0.102476 0.167025 0.151070 0.155136 0.155889 0.166663 0.166570 0.132377 0.122448 0.127550 0.130634 0.111325 0.116382
qa: -0.1373 -0.4358 0.6093 -0.4280 -0.4237 -0.3238 -0.3392 -0.0555 -0.0056 -0.0581 0.3011 0.3412 -0.0649 -0.1136 -0.1113 -0.1164 -0.1159 -0.1231 -0.1025 0.1670 0.1511 0.1551 0.1559 0.1667 0.1666 0.1324 0.1224 0.1276 0.1306 0.1113 0.1164
va: 2.2834 2.0475 5.4407 2.0768 2.0869 2.0451 2.0786 3.1082 3.5653 3.5999 4.1756 4.1519 3.9083 3.9680 3.9699 3.9018 3.9031 3.8401 3.8397 0.9937 1.0215 1.0024 1.0018 0.9877 0.9877 1.0081 0.9884 0.9848 0.9879 1.0041 0.9950
dispcorr: -0.018806201 hartree
energy: -1920.039184003199
dipole: 9.29648 -6.11096 3.18551 0.11505 -0.36649 -0.25144 9.85792 -8.33415 1.52376
magnitude: 3.54014 au
magnitude: 8.99832 debye
