program: Orca
programVersion: 5.0.2
elementType: S S P O O O O N C C C C C C C C C C C H H H H H H H H H H H H
charge: 0
multiplicity: 1
keywords: wb97x-d3
keywords: def2-TZVPP
keywords: def2/J RIJCOSX
keywords: DEFGRID2
keywords: scfconv7
keywords: smallprint printgap noloewdin
keywords: NOSOSCF
formula: C11H12NO4PS2
InChI: InChI=1/C11H12NO4PS2/c1-15-17(18,16-2)19-7-12-10(13)8-5-3-4-6-9(8)11(12)14/h3-6H,7H2,1-2H3
31 atoms
S  -2.078234 -1.024245 1.325991
S  -3.548704 -0.511397 -1.571761
P  -2.007534 -0.072025 -0.514497
O  0.989708 -2.314887 1.251433
O  0.634434 2.220693 1.551098
O  -0.586906 -0.430455 -1.173533
O  -1.774489 1.452278 -0.106606
N  0.516125 -0.088718 1.595127
C  2.339814 -0.548202 0.284992
C  2.224846 0.829019 0.376398
C  1.24321 -1.151463 1.067405
C  1.053853 1.141567 1.217817
C  -0.717125 -0.244198 2.295618
C  3.343081 -1.143547 -0.448295
C  3.107484 1.675677 -0.258007
C  4.239922 -0.29805 -1.098272
C  4.125045 1.085557 -1.004387
C  -0.404514 -1.66148 -1.881286
C  -1.501433 2.441639 -1.113009
H  -0.598019 -0.902304 3.155639
H  -1.045665 0.726459 2.655111
H  3.433729 -2.218945 -0.521473
H  3.016082 2.7512 -0.186429
H  5.04102 -0.723373 -1.68728
H  4.838215 1.712549 -1.521997
H  -0.672468 -2.521329 -1.266141
H  0.650843 -1.720901 -2.13482
H  -0.997908 -1.673742 -2.794749
H  -0.482485 2.347211 -1.48489
H  -1.62556 3.410386 -0.637979
H  -2.203159 2.359813 -1.943821
elementType: S P O N C H
totalener: -1920.01773894 hartree
nucrepener: 2027.48497539 hartree
electener: -3947.50271433 hartree
oneelecener: -6674.20759868 hartree
twoeener: 2726.70488435 hartree
cpcmener: -0.03559380 hartree
kineticenergy: 1914.71738387 hartree
xcener: -128.576068688226 hartree
chargesum: -0.0000000
charge: -0.143612 -0.434503 0.610209 -0.414961 -0.427083 -0.320512 -0.340887 -0.068491 -0.042559 0.019482 0.315104 0.298183 -0.042653 -0.145391 -0.116961 -0.104110 -0.118942 -0.117819 -0.113357 0.166513 0.146637 0.155763 0.155827 0.167037 0.166734 0.119629 0.129396 0.128521 0.122402 0.132677 0.117727
qa: -0.1436 -0.4345 0.6102 -0.4150 -0.4271 -0.3205 -0.3409 -0.0685 -0.0426 0.0195 0.3151 0.2982 -0.0427 -0.1454 -0.1170 -0.1041 -0.1189 -0.1178 -0.1134 0.1665 0.1466 0.1558 0.1558 0.1670 0.1667 0.1196 0.1294 0.1285 0.1224 0.1327 0.1177
va: 2.2749 2.0474 5.4505 2.0920 2.0758 2.0477 2.0809 3.1140 3.5595 3.5998 4.1553 4.1717 3.8962 3.9611 3.9618 3.8927 3.9047 3.8261 3.8283 0.9917 1.0228 1.0038 1.0030 0.9870 0.9875 0.9956 0.9885 1.0071 0.9900 0.9890 1.0059
dispcorr: -0.019324629 hartree
energy: -1920.037063565129
dipole: 11.01436 -7.66093 3.35343 3.73571 -3.01506 0.72065 -7.60533 6.74531 -0.86002
magnitude: 3.53616 au
magnitude: 8.98820 debye
