program: Orca
programVersion: 5.0.2
elementType: S S P O O O O N C C C C C C C C C C C H H H H H H H H H H H H
charge: 0
multiplicity: 1
keywords: wb97x-d3
keywords: def2-TZVPP
keywords: def2/J RIJCOSX
keywords: DEFGRID2
keywords: scfconv7
keywords: smallprint printgap noloewdin
keywords: NOSOSCF
formula: C11H12NO4PS2
InChI: InChI=1/C11H12NO4PS2/c1-15-17(18,16-2)19-7-12-10(13)8-5-3-4-6-9(8)11(12)14/h3-6H,7H2,1-2H3
31 atoms
S  -1.773506 -0.524747 1.766161
S  -3.640087 1.473267 -0.093865
P  -2.029204 0.429402 -0.061509
O  0.747299 -2.235273 -1.175747
O  1.348407 0.262218 2.589727
O  -1.873606 -0.687631 -1.199245
O  -0.643384 1.209675 -0.224726
N  0.762557 -1.135765 0.857731
C  2.313976 -0.458999 -0.684841
C  2.504167 0.29935 0.458395
C  1.197219 -1.395714 -0.441042
C  1.511619 -0.13181 1.465254
C  -0.400334 -1.713768 1.445177
C  3.084166 -0.277256 -1.81311
C  3.476585 1.273698 0.526066
C  4.065727 0.709576 -1.758906
C  4.258854 1.4704 -0.60982
C  -2.921651 -1.6253 -1.449037
C  -0.390459 2.036787 -1.368219
H  -0.756129 -2.521416 0.810525
H  -0.179384 -2.128617 2.428872
H  2.93423 -0.869917 -2.705975
H  3.626897 1.866154 1.418928
H  4.689445 0.889664 -2.624357
H  5.030157 2.229132 -0.600543
H  -3.819795 -1.121864 -1.807461
H  -3.167375 -2.199148 -0.553767
H  -2.558232 -2.304082 -2.21611
H  -1.193281 2.76034 -1.515456
H  -0.271005 1.436943 -2.269927
H  0.534722 2.570811 -1.167118
elementType: S P O N C H
totalener: -1920.02436308 hartree
nucrepener: 2013.15774324 hartree
electener: -3933.18210632 hartree
oneelecener: -6645.64540092 hartree
twoeener: 2712.46329460 hartree
cpcmener: -0.03101034 hartree
kineticenergy: 1914.71272203 hartree
xcener: -128.572275573093 hartree
chargesum: 0.0000000
charge: -0.139426 -0.428311 0.600029 -0.401216 -0.391549 -0.314139 -0.325394 -0.074557 -0.010023 -0.063860 0.289727 0.340658 -0.055805 -0.116024 -0.125624 -0.115011 -0.117022 -0.115323 -0.116962 0.147362 0.165294 0.153813 0.155052 0.163620 0.163395 0.120831 0.112220 0.128577 0.122838 0.125523 0.121305
qa: -0.1394 -0.4283 0.6000 -0.4012 -0.3915 -0.3141 -0.3254 -0.0746 -0.0100 -0.0639 0.2897 0.3407 -0.0558 -0.1160 -0.1256 -0.1150 -0.1170 -0.1153 -0.1170 0.1474 0.1653 0.1538 0.1551 0.1636 0.1634 0.1208 0.1122 0.1286 0.1228 0.1255 0.1213
va: 2.2723 2.0561 5.4563 2.1126 2.1314 2.0706 2.0884 3.1032 3.5569 3.5990 4.2115 4.1780 3.9079 3.9664 3.9808 3.9029 3.9053 3.8489 3.8404 1.0148 0.9941 1.0032 1.0022 0.9889 0.9891 1.0041 0.9895 0.9908 1.0052 0.9894 0.9872
dispcorr: -0.018664943 hartree
energy: -1920.043028020315
dipole: 6.63361 -4.23363 2.39998 -0.11176 -0.41902 -0.53079 -10.18444 8.50220 -1.68223
magnitude: 2.97851 au
magnitude: 7.57077 debye
