program: Orca
programVersion: 5.0.2
elementType: S S P O O O O N C C C C C C C C C C C H H H H H H H H H H H H
charge: 0
multiplicity: 1
keywords: wb97x-d3
keywords: def2-TZVPP
keywords: def2/J RIJCOSX
keywords: DEFGRID2
keywords: scfconv7
keywords: smallprint printgap noloewdin
keywords: NOSOSCF
formula: C11H12NO4PS2
InChI: InChI=1/C11H12NO4PS2/c1-15-17(18,16-2)19-7-12-10(13)8-5-3-4-6-9(8)11(12)14/h3-6H,7H2,1-2H3
31 atoms
S  -1.771477 0.046747 -1.786189
S  -3.706711 1.301097 0.555232
P  -2.218708 0.129936 0.239076
O  0.720207 -2.283584 0.576861
O  1.385118 0.956032 -2.55733
O  -0.86272 0.508363 1.012598
O  -2.361649 -1.412263 0.620604
N  0.777653 -0.778161 -1.174566
C  2.382343 -0.529424 0.439554
C  2.590588 0.455142 -0.51303
C  1.211239 -1.332477 0.028358
C  1.558386 0.305308 -1.560324
C  -0.401932 -1.177266 -1.869047
C  3.186355 -0.641415 1.553557
C  3.610031 1.375213 -0.39344
C  4.220187 0.283305 1.685349
C  4.427745 1.273904 0.72982
C  -0.411498 1.862915 1.077075
C  -2.512035 -1.822747 1.987852
H  -0.202454 -1.281397 -2.935585
H  -0.736752 -2.141161 -1.493975
H  3.023358 -1.410007 2.297653
H  3.770659 2.146111 -1.135406
H  4.873256 0.232648 2.546315
H  5.238581 1.977695 0.864415
H  -1.127594 2.487801 1.612971
H  -0.247814 2.279007 0.080133
H  0.532126 1.853141 1.618568
H  -2.822359 -2.86527 1.965771
H  -3.278466 -1.235287 2.497343
H  -1.568673 -1.737964 2.528024
elementType: S P O N C H
totalener: -1920.02703646 hartree
nucrepener: 2001.66037163 hartree
electener: -3921.68740809 hartree
oneelecener: -6622.42361909 hartree
twoeener: 2700.73621100 hartree
cpcmener: -0.03019357 hartree
kineticenergy: 1914.70073189 hartree
xcener: -128.570655680655 hartree
chargesum: 0.0000000
charge: -0.133305 -0.430357 0.605084 -0.402209 -0.396968 -0.322509 -0.331035 -0.050953 -0.009340 -0.056307 0.283539 0.319451 -0.067719 -0.114485 -0.114861 -0.116559 -0.115012 -0.128106 -0.106224 0.164641 0.150167 0.153924 0.154667 0.163334 0.163720 0.132967 0.121317 0.126333 0.128588 0.111468 0.116748
qa: -0.1333 -0.4304 0.6051 -0.4022 -0.3970 -0.3225 -0.3310 -0.0510 -0.0093 -0.0563 0.2835 0.3195 -0.0677 -0.1145 -0.1149 -0.1166 -0.1150 -0.1281 -0.1062 0.1646 0.1502 0.1539 0.1547 0.1633 0.1637 0.1330 0.1213 0.1263 0.1286 0.1115 0.1167
va: 2.2815 2.0514 5.4453 2.1102 2.1208 2.0460 2.0881 3.0952 3.5756 3.6010 4.1928 4.1753 3.9057 3.9733 3.9773 3.9046 3.9050 3.8453 3.8450 0.9939 1.0222 1.0029 1.0024 0.9890 0.9889 1.0078 0.9897 0.9848 0.9881 1.0036 0.9942
dispcorr: -0.018576095 hartree
energy: -1920.045612550194
dipole: 9.29484 -6.23433 3.06050 0.04260 -0.34520 -0.30260 9.79105 -8.35124 1.43981
magnitude: 3.39578 au
magnitude: 8.63138 debye
