program: Orca
programVersion: 5.0.2
elementType: S S P O O O O N C C C C C C C C C C C H H H H H H H H H H H H
charge: 0
multiplicity: 1
keywords: wb97x-d3
keywords: def2-TZVPP
keywords: def2/J RIJCOSX
keywords: DEFGRID2
keywords: scfconv7
keywords: smallprint printgap noloewdin
keywords: NOSOSCF
formula: C11H12NO4PS2
InChI: InChI=1/C11H12NO4PS2/c1-15-17(18,16-2)19-7-12-10(13)8-5-3-4-6-9(8)11(12)14/h3-6H,7H2,1-2H3
31 atoms
S  -1.68629 0.092078 1.868547
S  -3.679239 1.356384 -0.41451
P  -2.207402 0.153122 -0.139734
O  0.657716 -2.321539 -0.53065
O  1.527544 0.956564 2.511111
O  -2.405849 -1.389136 -0.496042
O  -0.876263 0.482927 -0.976244
N  0.823414 -0.787105 1.186687
C  2.328271 -0.570504 -0.524085
C  2.601355 0.424532 0.400345
C  1.184215 -1.363212 -0.029211
C  1.635986 0.293705 1.512914
C  -0.334022 -1.151761 1.936192
C  3.049402 -0.694826 -1.691361
C  3.60746 1.344212 0.196359
C  4.067526 0.230521 -1.909715
C  4.340923 1.232222 -0.98292
C  -2.559948 -1.798583 -1.863851
C  -0.390453 1.820324 -1.094565
H  -0.697568 -2.118836 1.599058
H  -0.097483 -1.232428 2.996941
H  2.832129 -1.472009 -2.412195
H  3.818919 2.124334 0.915792
H  4.654417 0.172987 -2.81681
H  5.135709 1.937781 -1.185321
H  -3.245954 -1.143257 -2.40287
H  -2.975734 -2.802492 -1.844405
H  -1.598666 -1.817122 -2.374753
H  -0.039663 2.20156 -0.134131
H  -1.163077 2.486063 -1.480878
H  0.440318 1.792693 -1.795615
elementType: S P O N C H
totalener: -1920.02659178 hartree
nucrepener: 2005.47680030 hartree
electener: -3925.50339208 hartree
oneelecener: -6629.99436284 hartree
twoeener: 2704.49097076 hartree
cpcmener: -0.03016181 hartree
kineticenergy: 1914.71331872 hartree
xcener: -128.573300220598 hartree
chargesum: -0.0000000
charge: -0.133355 -0.429908 0.604102 -0.402896 -0.396440 -0.331534 -0.320444 -0.052895 -0.003421 -0.059515 0.282968 0.315738 -0.065967 -0.115527 -0.113052 -0.115823 -0.115899 -0.102645 -0.125954 0.150540 0.164029 0.153817 0.155603 0.163555 0.163736 0.111389 0.128025 0.113577 0.120904 0.131749 0.125544
qa: -0.1334 -0.4299 0.6041 -0.4029 -0.3964 -0.3315 -0.3204 -0.0529 -0.0034 -0.0595 0.2830 0.3157 -0.0660 -0.1155 -0.1131 -0.1158 -0.1159 -0.1026 -0.1260 0.1505 0.1640 0.1538 0.1556 0.1636 0.1637 0.1114 0.1280 0.1136 0.1209 0.1317 0.1255
va: 2.2835 2.0526 5.4437 2.1093 2.1207 2.0867 2.0466 3.0943 3.5612 3.5932 4.1984 4.1846 3.9080 3.9729 3.9750 3.9057 3.9060 3.8463 3.8447 1.0216 0.9945 1.0031 1.0019 0.9890 0.9889 1.0040 0.9889 0.9949 0.9872 1.0094 0.9846
dispcorr: -0.018762494 hartree
energy: -1920.045354269269
dipole: 8.89631 -5.91293 2.98338 -0.13285 -0.20216 -0.33500 -10.40336 8.79188 -1.61148
magnitude: 3.40730 au
magnitude: 8.66066 debye
