program: Orca
programVersion: 5.0.2
elementType: S S P O O O O N C C C C C C C C C C C H H H H H H H H H H H H
charge: 0
multiplicity: 1
keywords: wb97x-d3
keywords: def2-TZVPP
keywords: def2/J RIJCOSX
keywords: DEFGRID2
keywords: scfconv7
keywords: smallprint printgap noloewdin
keywords: NOSOSCF
formula: C11H12NO4PS2
InChI: InChI=1/C11H12NO4PS2/c1-15-17(18,16-2)19-7-12-10(13)8-5-3-4-6-9(8)11(12)14/h3-6H,7H2,1-2H3
31 atoms
S  -1.842726 -0.906573 0.290681
S  -2.268251 1.12106 -2.433938
P  -2.271639 0.968912 -0.521671
O  1.313528 0.884427 -1.181183
O  0.886985 -2.916992 1.298503
O  -1.299058 1.939876 0.290167
O  -3.670441 1.250413 0.216213
N  0.829994 -1.121347 -0.143361
C  2.715694 -0.036617 0.5669
C  2.588918 -1.18916 1.321863
C  1.57152 0.036013 -0.374833
C  1.361215 -1.895792 0.887275
C  -0.428383 -1.415307 -0.749791
C  3.771573 0.830947 0.746096
C  3.508933 -1.525153 2.291177
C  4.708493 0.502001 1.721095
C  4.578918 -0.656466 2.481937
C  -0.95051 3.222561 -0.226302
C  -4.873883 0.704347 -0.310196
H  -0.50179 -0.930045 -1.723679
H  -0.524165 -2.490937 -0.880938
H  3.865996 1.72968 0.151724
H  3.399625 -2.426758 2.878532
H  5.551603 1.157219 1.89436
H  5.322868 -0.882348 3.234014
H  -0.198062 3.627226 0.445349
H  -1.813621 3.889174 -0.241343
H  -0.536602 3.142538 -1.230385
H  -5.682437 1.059668 0.323784
H  -4.858762 -0.387325 -0.288085
H  -5.041222 1.034386 -1.336008
totalener: -1920.00378610 hartree
nucrepener: 1935.79872263 hartree
electener: -3855.80250873 hartree
oneelecener: -6490.91070614 hartree
twoeener: 2635.10819741 hartree
kineticenergy: 1914.78953316 hartree
xcener: -128.578979015758 hartree
chargesum: -0.0000000
charge: -0.131505 -0.389799 0.625058 -0.322629 -0.318053 -0.314384 -0.327812 -0.081669 -0.027087 -0.088509 0.258133 0.298515 -0.074697 -0.111111 -0.105972 -0.093193 -0.093954 -0.130825 -0.119441 0.152142 0.142990 0.144225 0.146761 0.134628 0.134814 0.113061 0.123167 0.125630 0.116609 0.102298 0.112610
qa: -0.1315 -0.3898 0.6251 -0.3226 -0.3181 -0.3144 -0.3278 -0.0817 -0.0271 -0.0885 0.2581 0.2985 -0.0747 -0.1111 -0.1060 -0.0932 -0.0940 -0.1308 -0.1194 0.1521 0.1430 0.1442 0.1468 0.1346 0.1348 0.1131 0.1232 0.1256 0.1166 0.1023 0.1126
va: 2.2885 2.0641 5.4264 2.1883 2.1982 2.0999 2.1110 3.1335 3.6487 3.7191 4.2511 4.2401 3.9011 4.0127 4.0137 3.9324 3.9347 3.8586 3.8748 1.0320 1.0039 1.0075 1.0063 0.9994 0.9994 0.9908 0.9917 0.9997 0.9917 0.9942 1.0042
dispcorr: -0.015299322 hartree
energy: -1920.019085425882
dipole: 1.58435 -0.53705 1.04729 6.11462 -5.68017 0.43445 2.69147 -1.85675 0.83472
magnitude: 1.40795 au
magnitude: 3.57872 debye
