program: Orca
programVersion: 5.0.2
elementType: S S P O O O O N C C C C C C C C C C C H H H H H H H H H H H H
charge: 0
multiplicity: 1
keywords: wb97x-d3
keywords: def2-TZVPP
keywords: def2/J RIJCOSX
keywords: DEFGRID2
keywords: scfconv7
keywords: smallprint printgap noloewdin
keywords: NOSOSCF
formula: C11H12NO4PS2
InChI: InChI=1/C11H12NO4PS2/c1-15-17(18,16-2)19-7-12-10(13)8-5-3-4-6-9(8)11(12)14/h3-6H,7H2,1-2H3
31 atoms
S  -1.49153 -0.939754 1.58625
S  -3.426753 1.633495 0.817025
P  -2.082186 0.445917 0.159068
O  0.556639 -1.279232 -2.021956
O  1.766106 -1.006546 2.368758
O  -2.461714 -0.397935 -1.157604
O  -0.675823 1.072347 -0.289924
N  0.884739 -1.342966 0.26734
C  2.380031 -0.107117 -0.946426
C  2.752572 -0.022999 0.382981
C  1.16833 -0.955206 -1.043882
C  1.792238 -0.817479 1.186217
C  -0.315019 -2.004963 0.656794
C  3.09052 0.531532 -1.940006
C  3.851879 0.707982 0.779575
C  4.200106 1.276024 -1.551608
C  4.573828 1.363053 -0.21342
C  -3.744141 -1.002698 -1.256032
C  -0.641524 2.141529 -1.233328
H  -0.793627 -2.412688 -0.230204
H  -0.098241 -2.819337 1.347584
H  2.794996 0.455155 -2.977804
H  4.13674 0.771056 1.821079
H  4.784027 1.795909 -2.299259
H  5.441158 1.950483 0.056394
H  -3.788438 -1.486813 -2.2283
H  -4.538016 -0.258916 -1.179104
H  -3.889641 -1.753315 -0.475469
H  -0.920022 1.793481 -2.228018
H  0.383301 2.504272 -1.25271
H  -1.306391 2.95069 -0.927831
totalener: -1920.00180566 hartree
nucrepener: 1992.69150248 hartree
electener: -3912.69330814 hartree
oneelecener: -6604.36476920 hartree
twoeener: 2691.67146105 hartree
kineticenergy: 1914.78520168 hartree
xcener: -128.579821603833 hartree
chargesum: -0.0000000
charge: -0.101743 -0.365873 0.578131 -0.307659 -0.307358 -0.299308 -0.312693 -0.076439 -0.051731 -0.034474 0.219091 0.282408 -0.088594 -0.134164 -0.106059 -0.087755 -0.094155 -0.127404 -0.137428 0.141417 0.148790 0.144865 0.147082 0.135621 0.135640 0.121416 0.117617 0.101716 0.128346 0.106572 0.124126
qa: -0.1017 -0.3659 0.5781 -0.3077 -0.3074 -0.2993 -0.3127 -0.0764 -0.0517 -0.0345 0.2191 0.2824 -0.0886 -0.1342 -0.1061 -0.0878 -0.0942 -0.1274 -0.1374 0.1414 0.1488 0.1449 0.1471 0.1356 0.1356 0.1214 0.1176 0.1017 0.1283 0.1066 0.1241
va: 2.2880 2.1130 5.4493 2.2032 2.2116 2.0739 2.0968 3.1023 3.5876 3.6615 4.2637 4.2458 3.9495 3.9995 4.0173 3.9263 3.9309 3.8718 3.8577 1.0181 0.9961 1.0093 1.0059 0.9989 0.9991 0.9895 1.0064 0.9930 0.9893 0.9888 1.0079
dispcorr: -0.017637784 hartree
energy: -1920.019443443501
dipole: 3.77347 -2.45354 1.31993 2.55293 -2.56569 -0.01276 -9.99104 8.63115 -1.35989
magnitude: 1.89518 au
magnitude: 4.81715 debye
