program: Orca
programVersion: 5.0.2
elementType: S S P O O O O N C C C C C C C C C C C H H H H H H H H H H H H
charge: 0
multiplicity: 1
keywords: wb97x-d3
keywords: def2-TZVPP
keywords: def2/J RIJCOSX
keywords: DEFGRID2
keywords: scfconv7
keywords: smallprint printgap noloewdin
keywords: NOSOSCF
formula: C11H12NO4PS2
InChI: InChI=1/C11H12NO4PS2/c1-15-17(18,16-2)19-7-12-10(13)8-5-3-4-6-9(8)11(12)14/h3-6H,7H2,1-2H3
31 atoms
S  -1.502435 -1.143697 1.507046
S  -3.321292 1.582692 1.112213
P  -2.027467 0.447592 0.281147
O  0.481807 -1.1916 -2.155757
O  1.753323 -1.227361 2.224874
O  -2.434356 -0.180279 -1.142436
O  -0.597306 1.076181 -0.086454
N  0.851274 -1.42921 0.114432
C  2.306603 -0.077874 -1.022711
C  2.689522 -0.076166 0.306175
C  1.108253 -0.936863 -1.166277
C  1.758811 -0.950995 1.059683
C  -0.344144 -2.120691 0.464306
C  2.990097 0.64642 -1.97535
C  3.769339 0.660011 0.744598
C  4.081489 1.394419 -1.544748
C  4.462809 1.40303 -0.205941
C  -3.719286 -0.762895 -1.313799
C  -0.523724 2.219103 -0.938517
H  -0.837618 -2.446056 -0.448184
H  -0.121151 -2.994152 1.076623
H  2.687302 0.632238 -3.013763
H  4.060553 0.661852 1.786236
H  4.643479 1.980768 -2.259294
H  5.312931 1.998871 0.098055
H  -3.765877 -1.122093 -2.338749
H  -4.509593 -0.031043 -1.143227
H  -3.866795 -1.604613 -0.63308
H  0.498062 2.585442 -0.878479
H  -1.20806 3.000364 -0.604307
H  -0.750558 1.949134 -1.969805
totalener: -1920.00123434 hartree
nucrepener: 2001.26185445 hartree
electener: -3921.26308879 hartree
oneelecener: -6621.46761652 hartree
twoeener: 2700.20452773 hartree
kineticenergy: 1914.78203907 hartree
xcener: -128.579597553153 hartree
chargesum: -0.0000000
charge: -0.100988 -0.362398 0.575203 -0.309234 -0.304437 -0.297755 -0.313723 -0.082850 -0.085985 -0.017365 0.239542 0.277898 -0.087772 -0.124009 -0.108005 -0.093032 -0.091784 -0.127838 -0.138204 0.140837 0.148238 0.144609 0.147097 0.135321 0.135920 0.121854 0.117523 0.100939 0.107661 0.123906 0.128830
qa: -0.1010 -0.3624 0.5752 -0.3092 -0.3044 -0.2978 -0.3137 -0.0829 -0.0860 -0.0174 0.2395 0.2779 -0.0878 -0.1240 -0.1080 -0.0930 -0.0918 -0.1278 -0.1382 0.1408 0.1482 0.1446 0.1471 0.1353 0.1359 0.1219 0.1175 0.1009 0.1077 0.1239 0.1288
va: 2.2887 2.1188 5.4543 2.2027 2.2143 2.0735 2.0966 3.1061 3.6003 3.6332 4.2559 4.2485 3.9524 3.9941 4.0215 3.9297 3.9265 3.8752 3.8541 1.0171 0.9961 1.0093 1.0059 0.9991 0.9990 0.9894 1.0057 0.9936 0.9871 1.0100 0.9894
dispcorr: -0.018053693 hartree
energy: -1920.019288032110
dipole: 3.72372 -2.44570 1.27802 3.71972 -3.60066 0.11906 -9.97242 8.55214 -1.42029
magnitude: 1.91435 au
magnitude: 4.86589 debye
