program: Orca
programVersion: 5.0.2
elementType: S S P O O O O N C C C C C C C C C C C H H H H H H H H H H H H
charge: 0
multiplicity: 1
keywords: wb97x-d3
keywords: def2-TZVPP
keywords: def2/J RIJCOSX
keywords: DEFGRID2
keywords: scfconv7
keywords: smallprint printgap noloewdin
keywords: NOSOSCF
formula: C11H12NO4PS2
InChI: InChI=1/C11H12NO4PS2/c1-15-17(18,16-2)19-7-12-10(13)8-5-3-4-6-9(8)11(12)14/h3-6H,7H2,1-2H3
31 atoms
S  -1.759806 -0.524057 1.753954
S  -3.565186 1.486426 -0.173146
P  -1.996031 0.399877 -0.092101
O  0.765588 -2.241149 -1.156642
O  1.38484 0.232764 2.627333
O  -1.864337 -0.760833 -1.195101
O  -0.576652 1.121167 -0.288947
N  0.786437 -1.154441 0.886191
C  2.309011 -0.444245 -0.668152
C  2.501163 0.308194 0.476332
C  1.206409 -1.402936 -0.422633
C  1.528304 -0.143237 1.499919
C  -0.386863 -1.719059 1.461295
C  3.067548 -0.246058 -1.801696
C  3.463622 1.292865 0.53952
C  4.036454 0.751482 -1.753275
C  4.231547 1.508049 -0.601128
C  -2.966704 -1.616335 -1.460454
C  -0.361164 1.996794 -1.393139
H  -0.727285 -2.530502 0.823185
H  -0.18115 -2.114556 2.455948
H  2.911239 -0.840932 -2.691503
H  3.610213 1.876011 1.438642
H  4.650928 0.942945 -2.622701
H  4.994688 2.274751 -0.594618
H  -3.823669 -1.04977 -1.826528
H  -3.266731 -2.166622 -0.565549
H  -2.638622 -2.322422 -2.218494
H  -1.09166 2.806254 -1.396433
H  -0.411186 1.459399 -2.340326
H  0.637833 2.406962 -1.269464
totalener: -1919.99968632 hartree
nucrepener: 2017.36381652 hartree
electener: -3937.36350283 hartree
oneelecener: -6653.63171358 hartree
twoeener: 2716.26821075 hartree
kineticenergy: 1914.78610137 hartree
xcener: -128.580344248192 hartree
chargesum: 0.0000000
charge: -0.103501 -0.363499 0.574446 -0.314132 -0.299799 -0.292147 -0.313266 -0.091258 -0.039423 -0.077990 0.239963 0.299082 -0.082624 -0.109528 -0.110215 -0.096877 -0.099271 -0.132224 -0.135291 0.137080 0.147887 0.144944 0.147006 0.135632 0.136046 0.120688 0.098970 0.124101 0.129543 0.120320 0.105336
qa: -0.1035 -0.3635 0.5744 -0.3141 -0.2998 -0.2921 -0.3133 -0.0913 -0.0394 -0.0780 0.2400 0.2991 -0.0826 -0.1095 -0.1102 -0.0969 -0.0993 -0.1322 -0.1353 0.1371 0.1479 0.1449 0.1470 0.1356 0.1360 0.1207 0.0990 0.1241 0.1295 0.1203 0.1053
va: 2.2821 2.1185 5.4548 2.1982 2.2212 2.0817 2.0947 3.0977 3.5730 3.6290 4.2600 4.2142 3.9539 4.0039 4.0124 3.9278 3.9293 3.8777 3.8700 1.0128 0.9968 1.0074 1.0061 0.9993 0.9994 1.0051 0.9930 0.9895 1.0056 0.9882 0.9865
dispcorr: -0.018690254 hartree
energy: -1920.018376573103
dipole: 6.23928 -4.65103 1.58825 0.12034 -0.40162 -0.28129 -10.08559 8.90419 -1.18140
magnitude: 1.99934 au
magnitude: 5.08193 debye
