program: Orca
programVersion: 5.0.2
elementType: S S P O O O O N C C C C C C C C C C C H H H H H H H H H H H H
charge: 0
multiplicity: 1
keywords: wb97x-d3
keywords: def2-TZVPP
keywords: def2/J RIJCOSX
keywords: DEFGRID2
keywords: scfconv7
keywords: smallprint printgap noloewdin
keywords: NOSOSCF
formula: C11H12NO4PS2
InChI: InChI=1/C11H12NO4PS2/c1-15-17(18,16-2)19-7-12-10(13)8-5-3-4-6-9(8)11(12)14/h3-6H,7H2,1-2H3
31 atoms
S  -1.627285 -1.565016 -0.831281
S  -3.005006 1.115787 -2.205849
P  -1.95057 0.483956 -0.741246
O  1.574266 -2.50638 -0.881512
O  0.170407 0.25164 2.46962
O  -0.455877 1.047201 -0.593015
O  -2.520379 0.788499 0.731641
N  0.566649 -1.306333 0.806663
C  2.665228 -0.626627 0.192595
C  2.231428 0.214684 1.201035
C  1.59456 -1.614141 -0.082759
C  0.87163 -0.208047 1.613795
C  -0.724784 -1.904463 0.734515
C  3.904071 -0.476497 -0.392344
C  3.018024 1.244662 1.671007
C  4.705434 0.562749 0.069752
C  4.268973 1.41034 1.084114
C  -0.221945 2.454025 -0.577716
C  -3.901878 0.602043 1.007338
H  -0.646942 -2.991156 0.758806
H  -1.310438 -1.574414 1.589022
H  4.235641 -1.140196 -1.179435
H  2.674856 1.896507 2.463158
H  5.683582 0.717477 -0.365599
H  4.915843 2.209489 1.420817
H  -0.58139 2.899443 0.349815
H  -0.703865 2.938287 -1.428139
H  0.854468 2.589196 -0.64809
H  -4.521292 1.214985 0.351614
H  -4.057289 0.898807 2.041495
H  -4.192355 -0.444319 0.887579
totalener: -1920.00178124 hartree
nucrepener: 1993.87576955 hartree
electener: -3913.87755079 hartree
oneelecener: -6606.73249596 hartree
twoeener: 2692.85494518 hartree
kineticenergy: 1914.78177157 hartree
xcener: -128.579338748263 hartree
chargesum: 0.0000000
charge: -0.100677 -0.366282 0.576454 -0.306627 -0.307288 -0.312101 -0.298194 -0.078309 -0.030705 -0.060808 0.284258 0.222625 -0.088990 -0.108682 -0.127768 -0.092470 -0.091750 -0.137208 -0.126949 0.148533 0.141696 0.146902 0.144640 0.135728 0.135328 0.127158 0.123928 0.107115 0.116585 0.121920 0.101936
qa: -0.1007 -0.3663 0.5765 -0.3066 -0.3073 -0.3121 -0.2982 -0.0783 -0.0307 -0.0608 0.2843 0.2226 -0.0890 -0.1087 -0.1278 -0.0925 -0.0917 -0.1372 -0.1269 0.1485 0.1417 0.1469 0.1446 0.1357 0.1353 0.1272 0.1239 0.1071 0.1166 0.1219 0.1019
va: 2.2876 2.1116 5.4487 2.2123 2.2038 2.0973 2.0750 3.1035 3.6522 3.5907 4.2429 4.2620 3.9499 4.0197 3.9978 3.9288 3.9294 3.8581 3.8724 0.9960 1.0176 1.0061 1.0089 0.9991 0.9990 0.9893 1.0082 0.9883 1.0066 0.9893 0.9929
dispcorr: -0.017688042 hartree
energy: -1920.019469279644
dipole: 3.97560 -2.73016 1.24545 8.05488 -7.34073 0.71415 6.53036 -5.27211 1.25825
magnitude: 1.90901 au
magnitude: 4.85233 debye
