program: Orca
programVersion: 5.0.2
elementType: S S P O O O O N C C C C C C C C C C C H H H H H H H H H H H H
charge: 0
multiplicity: 1
keywords: wb97x-d3
keywords: def2-TZVPP
keywords: def2/J RIJCOSX
keywords: DEFGRID2
keywords: scfconv7
keywords: smallprint printgap noloewdin
keywords: NOSOSCF
formula: C11H12NO4PS2
InChI: InChI=1/C11H12NO4PS2/c1-15-17(18,16-2)19-7-12-10(13)8-5-3-4-6-9(8)11(12)14/h3-6H,7H2,1-2H3
31 atoms
S  -2.188224 -0.368602 1.377745
S  -3.521688 -0.549032 -1.592186
P  -1.88341 -0.184496 -0.681068
O  0.860777 -1.988051 1.707906
O  0.839329 2.503184 0.910508
O  -0.609141 -1.087615 -1.0406
O  -1.164739 1.222421 -0.916401
N  0.520349 0.276837 1.449569
C  2.345711 -0.600474 0.385777
C  2.3337 0.760804 0.140493
C  1.185011 -0.930783 1.244397
C  1.167467 1.352451 0.834263
C  -0.703493 0.399168 2.164487
C  3.330404 -1.417769 -0.124601
C  3.305559 1.366943 -0.625518
C  4.314079 -0.818811 -0.905702
C  4.301662 0.550951 -1.152283
C  -0.763094 -2.503163 -1.102053
C  -1.923943 2.423339 -0.823051
H  -0.633598 -0.09421 3.13377
H  -0.89852 1.457216 2.319873
H  3.33751 -2.480418 0.077253
H  3.290593 2.43243 -0.810583
H  5.104289 -1.424915 -1.327992
H  5.081504 0.986053 -1.762684
H  -1.069316 -2.910528 -0.137733
H  0.210962 -2.907626 -1.364096
H  -1.492606 -2.780386 -1.863232
H  -1.230212 3.242124 -0.987574
H  -2.375068 2.534302 0.164688
H  -2.710888 2.442652 -1.577197
totalener: -1920.00174551 hartree
nucrepener: 2025.90282899 hartree
electener: -3945.90457450 hartree
oneelecener: -6670.67520907 hartree
twoeener: 2724.77063457 hartree
kineticenergy: 1914.78360141 hartree
xcener: -128.583524744637 hartree
chargesum: -0.0000000
charge: -0.125096 -0.360984 0.583546 -0.308389 -0.333109 -0.306373 -0.308977 -0.069399 -0.012627 0.024089 0.198657 0.214927 -0.072493 -0.126349 -0.102543 -0.094233 -0.094107 -0.135603 -0.133027 0.143340 0.138569 0.146166 0.143404 0.135001 0.134871 0.124261 0.110588 0.128494 0.124921 0.104499 0.127976
qa: -0.1251 -0.3610 0.5835 -0.3084 -0.3331 -0.3064 -0.3090 -0.0694 -0.0126 0.0241 0.1987 0.2149 -0.0725 -0.1263 -0.1025 -0.0942 -0.0941 -0.1356 -0.1330 0.1433 0.1386 0.1462 0.1434 0.1350 0.1349 0.1243 0.1106 0.1285 0.1249 0.1045 0.1280
va: 2.2701 2.1168 5.4862 2.2023 2.1790 2.1085 2.1118 3.0755 3.6201 3.6778 4.2580 4.2384 3.9286 4.0140 4.0114 3.9406 3.9386 3.8528 3.8661 0.9999 1.0098 1.0072 1.0070 0.9994 0.9993 0.9932 0.9895 1.0067 0.9921 0.9916 1.0043
dispcorr: -0.018942862 hartree
energy: -1920.020688371435
dipole: 8.11104 -6.25868 1.85236 1.10517 -0.84609 0.25908 -3.22060 3.15758 -0.06302
magnitude: 1.87145 au
magnitude: 4.75685 debye
