program: Orca
programVersion: 5.0.2
elementType: S S P O O O O N C C C C C C C C C C C H H H H H H H H H H H H
charge: 0
multiplicity: 1
keywords: wb97x-d3
keywords: def2-TZVPP
keywords: def2/J RIJCOSX
keywords: DEFGRID2
keywords: scfconv7
keywords: smallprint printgap noloewdin
keywords: NOSOSCF
formula: C11H12NO4PS2
InChI: InChI=1/C11H12NO4PS2/c1-15-17(18,16-2)19-7-12-10(13)8-5-3-4-6-9(8)11(12)14/h3-6H,7H2,1-2H3
31 atoms
S  -1.842094 -1.685907 -0.212045
S  -0.711154 1.257192 1.13759
P  -2.136027 0.325033 0.246503
O  1.352202 -2.675864 0.476221
O  0.675772 0.97883 -2.166136
O  -3.509985 0.221058 1.067534
O  -2.618682 0.910883 -1.157655
N  0.719727 -0.993572 -0.964084
C  2.593481 -0.599596 0.288575
C  2.378566 0.513098 -0.504725
C  1.523156 -1.585405 0.010132
C  1.169264 0.277542 -1.327051
C  -0.487107 -1.575494 -1.44481
C  3.659668 -0.671686 1.158409
C  3.218584 1.604262 -0.462639
C  4.51501 0.424365 1.210668
C  4.296926 1.544754 0.414425
C  -3.51431 0.000545 2.47352
C  -2.459466 2.287635 -1.49672
H  -0.82942 -1.009029 -2.307363
H  -0.32155 -2.610278 -1.742353
H  3.820719 -1.544994 1.775775
H  3.04262 2.471635 -1.084165
H  5.363365 0.408827 1.881712
H  4.978867 2.381879 0.48065
H  -4.540688 0.133571 2.806545
H  -2.867676 0.711328 2.988813
H  -3.190393 -1.013365 2.715777
H  -2.558408 2.352437 -2.576753
H  -1.478987 2.65947 -1.202264
H  -3.234516 2.891009 -1.023712
totalener: -1920.00135377 hartree
nucrepener: 1995.11670993 hartree
electener: -3915.11806370 hartree
oneelecener: -6609.79369028 hartree
twoeener: 2694.67562658 hartree
kineticenergy: 1914.78940938 hartree
xcener: -128.583307052932 hartree
chargesum: -0.0000000
charge: -0.120920 -0.403442 0.648897 -0.311592 -0.330764 -0.329399 -0.313441 -0.070477 -0.036372 -0.009733 0.277590 0.186982 -0.080710 -0.107055 -0.103719 -0.095052 -0.096323 -0.123668 -0.116864 0.152272 0.145458 0.144352 0.140681 0.132970 0.132257 0.116976 0.112992 0.108330 0.116967 0.112424 0.120384
qa: -0.1209 -0.4034 0.6489 -0.3116 -0.3308 -0.3294 -0.3134 -0.0705 -0.0364 -0.0097 0.2776 0.1870 -0.0807 -0.1071 -0.1037 -0.0951 -0.0963 -0.1237 -0.1169 0.1523 0.1455 0.1444 0.1407 0.1330 0.1323 0.1170 0.1130 0.1083 0.1170 0.1124 0.1204
va: 2.2810 2.0441 5.4197 2.2088 2.1759 2.1251 2.1141 3.0686 3.6480 3.6268 4.2455 4.2883 3.9303 4.0215 4.0197 3.9329 3.9381 3.8811 3.8617 1.0174 0.9944 1.0066 1.0079 0.9996 0.9997 0.9900 1.0049 0.9877 0.9908 1.0041 0.9900
dispcorr: -0.016914603 hartree
energy: -1920.018268377278
dipole: 0.30249 0.15823 0.46072 6.79740 -6.18883 0.60857 2.20415 -2.07618 0.12798
magnitude: 0.77395 au
magnitude: 1.96723 debye
