program: Orca
programVersion: 5.0.2
elementType: Cl S S P O O O O N C C C C C C C C C C C C H H H H H H H H H H H H H H H
charge: 0
multiplicity: 1
keywords: wb97x-d3
keywords: def2-TZVPP
keywords: def2/J RIJCOSX
keywords: DEFGRID2
keywords: scfconv7
keywords: smallprint printgap noloewdin
keywords: NOSOSCF
formula: C12H15ClNO4PS2
InChI: InChI=1/C12H15ClNO4PS2/c1-3-16-19(20,17-4-2)21-8-14-10-6-5-9(13)7-11(10)18-12(14)15/h5-7H,3-4,8H2,1-2H3
36 atoms
Cl 4.698664 0.549988 2.397898
S  -2.104314 0.288703 -1.572848
S  -1.024783 -2.808113 -0.582587
P  -1.865243 -1.14927 -0.07649
O  1.329457 2.947526 -0.657318
O  -3.358354 -1.247243 0.487554
O  -1.132164 -0.290704 1.051844
O  -0.325003 3.204751 -2.168632
N  0.503189 1.124567 -1.587409
C  1.461161 0.707631 -0.67233
C  -0.433828 0.323422 -2.313605
C  1.971195 1.867518 -0.114419
C  0.412985 2.486208 -1.54952
C  1.95073 -0.526236 -0.300503
C  2.966394 1.880662 0.829327
C  2.957281 -0.550614 0.659939
C  3.446927 0.62921 1.204958
C  -4.288583 -2.278359 0.088357
C  -0.597654 -0.908645 2.246106
C  -4.847663 -2.049669 -1.293195
C  0.04879 0.171423 3.072304
H  -0.571541 0.731915 -3.313476
H  -0.052322 -0.690146 -2.423803
H  1.569723 -1.447323 -0.719024
H  3.346837 2.800466 1.251133
H  3.358438 -1.502547 0.978319
H  -3.799714 -3.25115 0.160566
H  -5.076077 -2.240557 0.838657
H  -1.408051 -1.391555 2.795464
H  0.12686 -1.673218 1.960437
H  -4.086712 -2.151883 -2.067085
H  -5.616225 -2.798275 -1.487372
H  -5.309687 -1.066591 -1.383117
H  0.47025 -0.275969 3.972335
H  0.859717 0.659428 2.53038
H  -0.671991 0.928278 3.381275
elementType: Cl S P O N C H
totalener: -2420.15579207 hartree
nucrepener: 2471.45909399 hartree
electener: -4891.61488607 hartree
oneelecener: -8248.39560093 hartree
twoeener: 3356.78071487 hartree
cpcmener: -0.03130113 hartree
kineticenergy: 2413.95251041 hartree
xcener: -154.007067042449 hartree
chargesum: 0.0000000
charge: -0.094220 -0.139459 -0.446289 0.645490 -0.255671 -0.365803 -0.337142 -0.462933 -0.051250 0.038189 -0.069255 0.211787 0.436205 -0.222247 -0.167335 -0.135141 0.102709 0.042769 -0.001929 -0.251172 -0.236285 0.168660 0.156485 0.156196 0.145343 0.142971 0.096364 0.110829 0.138678 0.107984 0.078122 0.103474 0.094085 0.096349 0.065114 0.098326
qa: -0.0942 -0.1395 -0.4463 0.6455 -0.2557 -0.3658 -0.3371 -0.4629 -0.0512 0.0382 -0.0693 0.2118 0.4362 -0.2222 -0.1673 -0.1351 0.1027 0.0428 -0.0019 -0.2512 -0.2363 0.1687 0.1565 0.1562 0.1453 0.1430 0.0964 0.1108 0.1387 0.1080 0.0781 0.1035 0.0941 0.0963 0.0651 0.0983
va: 1.2047 2.2767 1.9975 5.4192 2.2116 2.1086 2.0825 2.0492 3.2077 3.7667 3.8977 3.8633 4.3256 3.9335 4.0410 3.9838 3.7966 3.8456 3.8184 3.8910 3.9519 0.9958 1.0144 1.0160 1.0112 1.0059 1.0131 0.9916 0.9940 0.9986 1.0170 1.0110 1.0029 1.0079 1.0071 1.0074
dispcorr: -0.022370533 hartree
energy: -2420.178162605968
dipole: -20.52569 20.31536 -0.21033 -12.11555 10.14116 -1.97439 2.97314 -2.30346 0.66968
magnitude: 2.09545 au
magnitude: 5.32621 debye
