program: Orca
programVersion: 5.0.2
elementType: Cl S S P O O O O N C C C C C C C C C C C C H H H H H H H H H H H H H H H
charge: 0
multiplicity: 1
keywords: wb97x-d3
keywords: def2-TZVPP
keywords: def2/J RIJCOSX
keywords: DEFGRID2
keywords: scfconv7
keywords: smallprint printgap noloewdin
keywords: NOSOSCF
formula: C12H15ClNO4PS2
InChI: InChI=1/C12H15ClNO4PS2/c1-3-16-19(20,17-4-2)21-8-14-10-6-5-9(13)7-11(10)18-12(14)15/h5-7H,3-4,8H2,1-2H3
36 atoms
Cl 4.916537 -1.910848 -0.916066
S  -1.128887 0.732419 2.158974
S  -3.245412 -1.661463 1.366159
P  -1.987965 -0.404167 0.637893
O  1.082808 1.362379 -1.924305
O  -0.686052 -0.982272 -0.073977
O  -2.531903 0.596642 -0.484053
O  -0.644816 2.757201 -1.550404
N  0.521302 1.729539 0.177061
C  1.59084 0.847331 0.196238
C  -0.286422 2.117242 1.287393
C  1.922808 0.632705 -1.12911
C  0.208711 2.028065 -1.121979
C  2.280125 0.219252 1.209547
C  2.93253 -0.202513 -1.53049
C  3.316297 -0.634516 0.838278
C  3.625667 -0.834218 -0.500398
C  -0.733502 -2.035706 -1.061945
C  -3.875898 1.117236 -0.50223
C  0.290891 -3.078269 -0.696594
C  -4.096714 2.194425 0.530294
H  0.323181 2.581146 2.062241
H  -1.022649 2.844637 0.958907
H  2.04177 0.369123 2.253146
H  3.171521 -0.358629 -2.573634
H  3.879659 -1.147035 1.60578
H  -1.732786 -2.473641 -1.105668
H  -0.519884 -1.583684 -2.030379
H  -4.005883 1.50973 -1.508891
H  -4.580384 0.29409 -0.370824
H  1.294022 -2.653027 -0.64024
H  0.056072 -3.546887 0.259344
H  0.30123 -3.856837 -1.45962
H  -5.089982 2.619656 0.385125
H  -4.052134 1.806113 1.548054
H  -3.370679 3.001567 0.430111
elementType: Cl S P O N C H
totalener: -2420.15302466 hartree
nucrepener: 2522.64891250 hartree
electener: -4942.80193716 hartree
oneelecener: -8351.09702620 hartree
twoeener: 3408.29508904 hartree
cpcmener: -0.03354320 hartree
kineticenergy: 2413.96184939 hartree
xcener: -154.009874529597 hartree
chargesum: -0.0000000
charge: -0.097069 -0.153677 -0.438403 0.608047 -0.255409 -0.321508 -0.325355 -0.460257 -0.076909 0.015669 -0.068958 0.241751 0.420429 -0.169634 -0.209642 -0.144350 0.126662 0.022322 0.023190 -0.240098 -0.248189 0.177657 0.156318 0.155111 0.145112 0.142351 0.103881 0.110682 0.111671 0.100051 0.080675 0.088380 0.099289 0.108407 0.081574 0.090229
qa: -0.0971 -0.1537 -0.4384 0.6080 -0.2554 -0.3215 -0.3254 -0.4603 -0.0769 0.0157 -0.0690 0.2418 0.4204 -0.1696 -0.2096 -0.1443 0.1267 0.0223 0.0232 -0.2401 -0.2482 0.1777 0.1563 0.1551 0.1451 0.1424 0.1039 0.1107 0.1117 0.1001 0.0807 0.0884 0.0993 0.1084 0.0816 0.0902
va: 1.1994 2.2468 2.0344 5.4504 2.1939 2.0855 2.0833 2.0469 3.1926 3.8223 3.9066 3.7845 4.3316 3.9951 4.0821 4.0030 3.7673 3.8295 3.8438 3.9567 3.8928 0.9848 1.0012 1.0025 1.0122 1.0065 1.0115 0.9954 0.9917 1.0136 0.9954 1.0091 1.0097 1.0132 1.0145 1.0053
dispcorr: -0.024120002 hartree
energy: -2420.177144663985
dipole: -17.47900 18.28541 0.80641 2.40271 -1.77074 0.63197 0.05757 0.34107 0.39865
magnitude: 1.09936 au
magnitude: 2.79436 debye
