program: Orca
programVersion: 5.0.2
elementType: Cl S S P O O O O N C C C C C C C C C C C C H H H H H H H H H H H H H H H
charge: 0
multiplicity: 1
keywords: wb97x-d3
keywords: def2-TZVPP
keywords: def2/J RIJCOSX
keywords: DEFGRID2
keywords: scfconv7
keywords: smallprint printgap noloewdin
keywords: NOSOSCF
formula: C12H15ClNO4PS2
InChI: InChI=1/C12H15ClNO4PS2/c1-3-16-19(20,17-4-2)21-8-14-10-6-5-9(13)7-11(10)18-12(14)15/h5-7H,3-4,8H2,1-2H3
36 atoms
Cl 5.226186 -0.479947 -1.409393
S  -2.26996 0.797497 0.934145
S  -3.706611 -1.002699 -1.375962
P  -2.137893 -0.903312 -0.270374
O  1.678052 2.771546 0.400636
O  -1.829218 -2.118069 0.719864
O  -0.716816 -0.878335 -0.987383
O  -0.213785 3.465449 1.41868
N  0.408669 1.239768 1.354535
C  1.473171 0.568079 0.768966
C  -0.760195 0.690957 1.969807
C  2.257862 1.550497 0.190112
C  0.528558 2.57483 1.101919
C  1.841393 -0.75871 0.701858
C  3.420669 1.288243 -0.489342
C  3.01318 -1.061263 0.015722
C  3.77671 -0.055175 -0.56285
C  -2.802029 -2.517229 1.713381
C  -0.510031 -0.339039 -2.309147
C  -3.52523 -3.767583 1.283348
C  -0.6955 1.156148 -2.389123
H  -0.567094 -0.336099 2.268935
H  -0.9983 1.249887 2.8733
H  1.247158 -1.544516 1.146815
H  4.015542 2.072426 -0.936578
H  3.327381 -2.092588 -0.065488
H  -2.237451 -2.680198 2.629827
H  -3.508522 -1.706562 1.906664
H  0.514549 -0.614494 -2.55334
H  -1.173191 -0.852031 -3.008032
H  -4.210236 -4.068698 2.076277
H  -4.11021 -3.60077 0.379394
H  -2.834066 -4.591656 1.108672
H  -0.438064 1.47883 -3.398523
H  -1.726564 1.456703 -2.202652
H  -0.044562 1.688741 -1.696442
elementType: Cl S P O N C H
totalener: -2420.15535111 hartree
nucrepener: 2469.72833545 hartree
electener: -4889.88368655 hartree
oneelecener: -8244.15218041 hartree
twoeener: 3354.26849386 hartree
cpcmener: -0.03746125 hartree
kineticenergy: 2413.95392613 hartree
xcener: -154.008638193358 hartree
chargesum: 0.0000000
charge: -0.094868 -0.148266 -0.435053 0.603499 -0.260394 -0.346268 -0.322854 -0.461606 -0.036083 0.047568 -0.062993 0.192044 0.434992 -0.228567 -0.176148 -0.117846 0.097053 0.042351 0.029518 -0.237578 -0.258012 0.153742 0.171240 0.153273 0.148643 0.144567 0.110712 0.090048 0.110000 0.111954 0.095684 0.073885 0.090456 0.111704 0.084077 0.089524
qa: -0.0949 -0.1483 -0.4351 0.6035 -0.2604 -0.3463 -0.3229 -0.4616 -0.0361 0.0476 -0.0630 0.1920 0.4350 -0.2286 -0.1761 -0.1178 0.0971 0.0424 0.0295 -0.2376 -0.2580 0.1537 0.1712 0.1533 0.1486 0.1446 0.1107 0.0900 0.1100 0.1120 0.0957 0.0739 0.0905 0.1117 0.0841 0.0895
va: 1.2050 2.2653 2.0300 5.4802 2.1937 2.0847 2.0986 2.0523 3.1922 3.7679 3.8951 3.8302 4.3095 3.9696 4.0775 3.9733 3.8321 3.8380 3.8104 3.9540 3.8942 1.0054 0.9955 1.0103 1.0096 1.0046 0.9910 1.0070 0.9915 1.0147 1.0067 1.0193 1.0040 1.0111 1.0184 1.0010
dispcorr: -0.022685913 hartree
energy: -2420.178037018534
dipole: -16.87963 17.98591 1.10629 -11.60453 9.53799 -2.06654 2.80835 -1.47976 1.32859
magnitude: 2.69436 au
magnitude: 6.84853 debye
