program: Orca
programVersion: 5.0.2
elementType: Cl S S P O O O O N C C C C C C C C C C C C H H H H H H H H H H H H H H H
charge: 0
multiplicity: 1
keywords: wb97x-d3
keywords: def2-TZVPP
keywords: def2/J RIJCOSX
keywords: DEFGRID2
keywords: scfconv7
keywords: smallprint printgap noloewdin
keywords: NOSOSCF
formula: C12H15ClNO4PS2
InChI: InChI=1/C12H15ClNO4PS2/c1-3-16-19(20,17-4-2)21-8-14-10-6-5-9(13)7-11(10)18-12(14)15/h5-7H,3-4,8H2,1-2H3
36 atoms
Cl 5.079401 -0.426538 -1.602699
S  -2.270723 0.74725 1.163002
S  -3.761954 -0.985193 -1.170076
P  -2.108713 -0.82721 -0.202269
O  1.624462 2.787711 0.440791
O  -1.598655 -2.087456 0.637028
O  -0.771587 -0.615839 -1.04132
O  -0.209849 3.459313 1.571465
N  0.421011 1.237292 1.450151
C  1.455081 0.579603 0.798978
C  -0.707232 0.664699 2.11619
C  2.196513 1.572048 0.181795
C  0.517654 2.575869 1.204163
C  1.828385 -0.743613 0.70271
C  3.319148 1.322964 -0.567043
C  2.96101 -1.032639 -0.050813
C  3.680254 -0.017131 -0.668705
C  -2.484061 -2.7660 1.556062
C  -0.728102 0.038426 -2.325091
C  -2.932882 -4.078299 0.967937
C  -0.981159 1.522755 -2.249321
H  -0.482727 -0.360091 2.400658
H  -0.91436 1.21821 3.031177
H  1.26802 -1.536896 1.176738
H  3.880817 2.113844 -1.04393
H  3.277625 -2.060803 -0.154787
H  -1.908897 -2.913789 2.468879
H  -3.34037 -2.134461 1.804524
H  0.276469 -0.162654 -2.69305
H  -1.437984 -0.446873 -2.996801
H  -3.546407 -4.607099 1.697614
H  -3.531028 -3.927799 0.069678
H  -2.083334 -4.714707 0.720757
H  -0.834457 1.948026 -3.242644
H  -2.000354 1.753231 -1.939795
H  -0.287051 2.019528 -1.572421
elementType: Cl S P O N C H
totalener: -2420.15561340 hartree
nucrepener: 2474.94768631 hartree
electener: -4895.10329970 hartree
oneelecener: -8254.75197915 hartree
twoeener: 3359.64867944 hartree
cpcmener: -0.03738495 hartree
kineticenergy: 2413.95245275 hartree
xcener: -154.007818573296 hartree
chargesum: -0.0000000
charge: -0.094906 -0.144950 -0.434960 0.599707 -0.259641 -0.343810 -0.322174 -0.461291 -0.036769 0.043030 -0.061633 0.195966 0.429838 -0.224352 -0.180355 -0.117508 0.099205 0.044699 0.029502 -0.234459 -0.261625 0.152480 0.170916 0.155308 0.148187 0.144739 0.109363 0.087442 0.109667 0.109644 0.095207 0.073781 0.090518 0.112046 0.083358 0.093831
qa: -0.0949 -0.1450 -0.4350 0.5997 -0.2596 -0.3438 -0.3222 -0.4613 -0.0368 0.0430 -0.0616 0.1960 0.4298 -0.2244 -0.1804 -0.1175 0.0992 0.0447 0.0295 -0.2345 -0.2616 0.1525 0.1709 0.1553 0.1482 0.1447 0.1094 0.0874 0.1097 0.1096 0.0952 0.0738 0.0905 0.1120 0.0834 0.0938
va: 1.2048 2.2676 2.0290 5.4769 2.1926 2.0854 2.0963 2.0520 3.1910 3.7715 3.9032 3.8340 4.3124 3.9733 4.0818 3.9842 3.8292 3.8393 3.8172 3.9522 3.8989 1.0039 0.9941 1.0088 1.0099 1.0044 0.9920 1.0087 0.9915 1.0140 1.0072 1.0184 1.0040 1.0112 1.0166 1.0013
dispcorr: -0.022708239 hartree
energy: -2420.178321637470
dipole: -15.64250 16.82769 1.18519 -11.81871 9.69441 -2.12429 2.02779 -0.88500 1.14279
magnitude: 2.68761 au
magnitude: 6.83136 debye
