program: Orca
programVersion: 5.0.2
elementType: Cl S S P O O O O N C C C C C C C C C C C C H H H H H H H H H H H H H H H
charge: 0
multiplicity: 1
keywords: wb97x-d3
keywords: def2-TZVPP
keywords: def2/J RIJCOSX
keywords: DEFGRID2
keywords: scfconv7
keywords: smallprint printgap noloewdin
keywords: NOSOSCF
formula: C12H15ClNO4PS2
InChI: InChI=1/C12H15ClNO4PS2/c1-3-16-19(20,17-4-2)21-8-14-10-6-5-9(13)7-11(10)18-12(14)15/h5-7H,3-4,8H2,1-2H3
36 atoms
Cl 4.668511 -1.396903 -1.241205
S  -2.340355 1.34177 1.228198
S  -3.796838 -0.688122 -0.911611
P  -2.114597 -0.253661 -0.087847
O  1.510812 2.584235 -0.44953
O  -1.374117 -1.408356 0.734733
O  -0.945211 0.249337 -1.048433
O  -0.181768 3.778082 0.444485
N  0.398915 1.679096 1.230777
C  1.351727 0.750978 0.831199
C  -0.720781 1.44038 2.089031
C  2.03357 1.342376 -0.217414
C  0.487264 2.781056 0.427515
C  1.696123 -0.505616 1.278182
C  3.060006 0.730736 -0.891355
C  2.735879 -1.15437 0.619291
C  3.391139 -0.544889 -0.442159
C  -2.097397 -2.250057 1.659545
C  -0.649749 -0.395461 -2.309829
C  -2.296542 -3.623314 1.071266
C  -0.057113 -1.774438 -2.156938
H  -0.544004 0.536347 2.664711
H  -0.845416 2.261426 2.794141
H  1.19199 -0.98221 2.10695
H  3.573923 1.207604 -1.714368
H  3.029116 -2.144188 0.939582
H  -1.491242 -2.289403 2.563636
H  -3.055076 -1.795862 1.923625
H  -1.559207 -0.423305 -2.9130
H  0.056021 0.275853 -2.794713
H  -1.345465 -4.08964 0.814333
H  -2.791651 -4.258452 1.806279
H  -2.923604 -3.587901 0.180793
H  -0.774028 -2.497507 -1.768038
H  0.253686 -2.123719 -3.142008
H  0.822956 -1.768242 -1.513407
elementType: Cl S P O N C H
totalener: -2420.15419239 hartree
nucrepener: 2524.30802160 hartree
electener: -4944.46221399 hartree
oneelecener: -8353.80141261 hartree
twoeener: 3409.33919862 hartree
cpcmener: -0.03971041 hartree
kineticenergy: 2413.95793901 hartree
xcener: -154.008237030673 hartree
chargesum: -0.0000000
charge: -0.095528 -0.145735 -0.438662 0.595661 -0.257182 -0.321360 -0.317817 -0.452842 -0.073713 0.032187 -0.051222 0.218406 0.427023 -0.221247 -0.176898 -0.111835 0.097657 0.048120 -0.000292 -0.244525 -0.237043 0.150097 0.171066 0.155183 0.145167 0.140434 0.104838 0.090558 0.109337 0.112205 0.092607 0.102246 0.077498 0.083373 0.108345 0.083893
qa: -0.0955 -0.1457 -0.4387 0.5957 -0.2572 -0.3214 -0.3178 -0.4528 -0.0737 0.0322 -0.0512 0.2184 0.4270 -0.2212 -0.1769 -0.1118 0.0977 0.0481 -0.0003 -0.2445 -0.2370 0.1501 0.1711 0.1552 0.1452 0.1404 0.1048 0.0906 0.1093 0.1122 0.0926 0.1022 0.0775 0.0834 0.1083 0.0839
va: 1.2025 2.2789 2.0335 5.4553 2.1947 2.0557 2.0909 2.0619 3.2113 3.7809 3.9200 3.8056 4.3326 3.9776 4.0643 3.9429 3.7957 3.8289 3.8629 3.9344 3.8939 1.0053 0.9914 1.0025 1.0109 1.0073 0.9950 1.0119 1.0099 0.9871 1.0020 1.0100 1.0171 1.0143 1.0115 1.0028
dispcorr: -0.024313564 hartree
energy: -2420.178505951849
dipole: -10.01985 11.56862 1.54876 -18.49278 15.85630 -2.63648 3.53159 -1.61069 1.92090
magnitude: 3.61103 au
magnitude: 9.17851 debye
