program: Orca
programVersion: 5.0.2
elementType: Cl S S P O O O O N C C C C C C C C C C C C H H H H H H H H H H H H H H H
charge: 0
multiplicity: 1
keywords: wb97x-d3
keywords: def2-TZVPP
keywords: def2/J RIJCOSX
keywords: DEFGRID2
keywords: scfconv7
keywords: smallprint printgap noloewdin
keywords: NOSOSCF
formula: C12H15ClNO4PS2
InChI: InChI=1/C12H15ClNO4PS2/c1-3-16-19(20,17-4-2)21-8-14-10-6-5-9(13)7-11(10)18-12(14)15/h5-7H,3-4,8H2,1-2H3
36 atoms
Cl 4.767222 -2.251327 0.162489
S  -2.023856 1.829429 -0.250133
S  -1.529378 -0.318984 2.370827
P  -1.958742 -0.114179 0.5042
O  1.758889 1.103391 -2.312322
O  -0.965977 -0.811753 -0.536179
O  -3.394185 -0.641207 0.031773
O  0.158575 2.662986 -2.618644
N  0.699137 1.845477 -0.523155
C  1.597026 0.880684 -0.085904
C  -0.368876 2.441479 0.221971
C  2.252071 0.439085 -1.2230
C  0.789534 1.955887 -1.88054
C  1.920802 0.377519 1.155215
C  3.23339 -0.518863 -1.20687
C  2.911804 -0.598409 1.207956
C  3.543673 -1.031354 0.049821
C  -0.303098 -2.062271 -0.2331
C  -4.531277 -0.721921 0.9191
C  -1.249022 -3.237706 -0.244115
C  -5.151938 0.627207 1.178258
H  -0.198375 2.28552 1.284733
H  -0.404206 3.515303 0.044311
H  1.428578 0.708374 2.058229
H  3.728413 -0.851171 -2.108465
H  3.186603 -1.019694 2.16461
H  0.455609 -2.162119 -1.007189
H  0.203393 -1.975376 0.729474
H  -5.230432 -1.38239 0.4102
H  -4.228122 -1.202726 1.850016
H  -1.966824 -3.197983 0.575704
H  -1.793797 -3.309203 -1.184943
H  -0.668326 -4.15256 -0.124315
H  -4.485677 1.283747 1.738109
H  -5.43668 1.123744 0.251038
H  -6.054488 0.489969 1.774223
elementType: Cl S P O N C H
totalener: -2420.15342458 hartree
nucrepener: 2495.26572427 hartree
electener: -4915.41914885 hartree
oneelecener: -8296.18864629 hartree
twoeener: 3380.76949744 hartree
cpcmener: -0.03270823 hartree
kineticenergy: 2413.97292620 hartree
xcener: -154.012168836177 hartree
chargesum: -0.0000000
charge: -0.094031 -0.138579 -0.441081 0.638214 -0.255806 -0.339142 -0.367293 -0.457104 -0.058642 0.013159 -0.059080 0.253855 0.429482 -0.191075 -0.226087 -0.159463 0.146405 0.031531 0.047373 -0.247211 -0.252641 0.149286 0.172553 0.144864 0.146647 0.143206 0.115067 0.097240 0.112587 0.095919 0.079805 0.094865 0.099918 0.077609 0.094486 0.103164
qa: -0.0940 -0.1386 -0.4411 0.6382 -0.2558 -0.3391 -0.3673 -0.4571 -0.0586 0.0132 -0.0591 0.2539 0.4295 -0.1911 -0.2261 -0.1595 0.1464 0.0315 0.0474 -0.2472 -0.2526 0.1493 0.1726 0.1449 0.1466 0.1432 0.1151 0.0972 0.1126 0.0959 0.0798 0.0949 0.0999 0.0776 0.0945 0.1032
va: 1.2057 2.2817 1.9974 5.4232 2.2041 2.0800 2.0947 2.0562 3.1956 3.7734 3.9068 3.7965 4.3339 3.9363 4.0938 4.0023 3.7778 3.8226 3.8300 3.9574 3.9039 1.0163 0.9924 1.0146 1.0120 1.0065 0.9829 1.0051 0.9913 1.0133 1.0147 1.0056 1.0069 1.0176 1.0030 1.0108
dispcorr: -0.022845374 hartree
energy: -2420.176269954798
dipole: -24.69209 24.36368 -0.32841 -6.13300 5.29395 -0.83905 7.05834 -5.33744 1.72090
magnitude: 1.94251 au
magnitude: 4.93747 debye
