program: Orca
programVersion: 5.0.2
elementType: Cl S S P O O O O N C C C C C C C C C C C C H H H H H H H H H H H H H H H
charge: 0
multiplicity: 1
keywords: wb97x-d3
keywords: def2-TZVPP
keywords: def2/J RIJCOSX
keywords: DEFGRID2
keywords: scfconv7
keywords: smallprint printgap noloewdin
keywords: NOSOSCF
formula: C12H15ClNO4PS2
InChI: InChI=1/C12H15ClNO4PS2/c1-3-16-19(20,17-4-2)21-8-14-10-6-5-9(13)7-11(10)18-12(14)15/h5-7H,3-4,8H2,1-2H3
36 atoms
Cl 4.566768 -2.196294 -0.250731
S  -2.297945 1.816111 -0.243222
S  -3.744001 -0.781116 1.192032
P  -2.141334 -0.180211 0.315764
O  1.876879 1.962086 1.138548
O  -0.79925 -0.142607 1.178656
O  -1.677701 -1.01906 -0.965894
O  0.249634 3.522458 1.092734
N  0.446068 1.89563 -0.542108
C  1.307161 0.818707 -0.702764
C  -0.783194 2.118775 -1.238056
C  2.199179 0.890618 0.352802
C  0.780972 2.564835 0.600287
C  1.409214 -0.179447 -1.646621
C  3.219342 -0.006504 0.544148
C  2.432252 -1.108691 -1.482523
C  3.309701 -1.016332 -0.410325
C  -0.211206 -1.346117 1.724671
C  -2.608351 -1.657444 -1.864906
C  0.402444 -1.01077 3.058055
C  -3.380024 -0.674079 -2.709255
H  -0.868137 3.161679 -1.541027
H  -0.799738 1.510335 -2.137992
H  0.732598 -0.25296 -2.486236
H  3.901228 0.06638 1.379982
H  2.540752 -1.907924 -2.20206
H  -0.972872 -2.121423 1.836715
H  0.538661 -1.704953 1.018286
H  -1.987683 -2.299595 -2.486606
H  -3.281841 -2.293095 -1.288011
H  -0.353204 -0.684659 3.772306
H  0.885986 -1.899282 3.462846
H  1.159187 -0.230904 2.97167
H  -2.715951 -0.001593 -3.252529
H  -3.965102 -1.229385 -3.442804
H  -4.074883 -0.0783 -2.118163
elementType: Cl S P O N C H
totalener: -2420.15483116 hartree
nucrepener: 2523.53912639 hartree
electener: -4943.69395755 hartree
oneelecener: -8352.10773176 hartree
twoeener: 3408.41377420 hartree
cpcmener: -0.04049401 hartree
kineticenergy: 2413.95774676 hartree
xcener: -154.008379088039 hartree
chargesum: 0.0000000
charge: -0.094819 -0.140846 -0.438327 0.600044 -0.259294 -0.326399 -0.324372 -0.454235 -0.067025 0.033517 -0.051090 0.206649 0.425028 -0.195715 -0.202674 -0.137180 0.127433 0.010349 0.037072 -0.251448 -0.249375 0.171339 0.148808 0.151847 0.148553 0.141621 0.114355 0.112358 0.106971 0.099391 0.092162 0.097417 0.090640 0.093848 0.106419 0.076977
qa: -0.0948 -0.1408 -0.4383 0.6000 -0.2593 -0.3264 -0.3244 -0.4542 -0.0670 0.0335 -0.0511 0.2066 0.4250 -0.1957 -0.2027 -0.1372 0.1274 0.0103 0.0371 -0.2514 -0.2494 0.1713 0.1488 0.1518 0.1486 0.1416 0.1144 0.1124 0.1070 0.0994 0.0922 0.0974 0.0906 0.0938 0.1064 0.0770
va: 1.2042 2.2674 2.0380 5.4524 2.1840 2.0842 2.0704 2.0598 3.2143 3.7911 3.9185 3.7739 4.3346 3.9682 4.0520 4.0033 3.7893 3.8289 3.8366 3.9428 3.9030 0.9915 1.0052 1.0052 1.0096 1.0070 1.0111 0.9896 0.9919 1.0137 1.0082 1.0063 1.0034 1.0019 1.0130 1.0158
dispcorr: -0.024250285 hartree
energy: -2420.179081449405
dipole: -12.41698 13.47127 1.05428 -7.10173 5.30503 -1.79671 -6.40241 3.26646 -3.13595
magnitude: 3.76481 au
magnitude: 9.56940 debye
