program: Orca
programVersion: 5.0.2
elementType: Cl S S P O O O O N C C C C C C C C C C C C H H H H H H H H H H H H H H H
charge: 0
multiplicity: 1
keywords: wb97x-d3
keywords: def2-TZVPP
keywords: def2/J RIJCOSX
keywords: DEFGRID2
keywords: scfconv7
keywords: smallprint printgap noloewdin
keywords: NOSOSCF
formula: C12H15ClNO4PS2
InChI: InChI=1/C12H15ClNO4PS2/c1-3-16-19(20,17-4-2)21-8-14-10-6-5-9(13)7-11(10)18-12(14)15/h5-7H,3-4,8H2,1-2H3
36 atoms
Cl 4.760351 -2.115341 0.961117
S  -1.94609 1.336318 -1.052842
S  -1.934035 1.222464 2.38044
P  -2.250032 0.278059 0.732368
O  2.237155 0.718194 -2.507552
O  -1.369168 -1.053444 0.674979
O  -3.755989 -0.13558 0.398519
O  0.641181 2.07124 -3.352794
N  0.786201 1.595846 -1.093442
C  1.607303 0.75545 -0.354508
C  -0.410612 2.253345 -0.671357
C  2.514419 0.231106 -1.259774
C  1.14963 1.529897 -2.408178
C  1.658867 0.407346 0.977265
C  3.502523 -0.654059 -0.913314
C  2.64805 -0.491655 1.364015
C  3.544227 -1.002205 0.434319
C  -1.491703 -2.04084 -0.377862
C  -4.696859 -0.523484 1.426271
C  -0.228404 -2.108476 -1.196427
C  -4.331369 -1.821276 2.101731
H  -0.363306 2.467508 0.395619
H  -0.502769 3.204299 -1.191763
H  0.958939 0.799054 1.702994
H  4.197142 -1.05444 -1.638587
H  2.714118 -0.790403 2.400709
H  -1.682387 -2.987472 0.126362
H  -2.353659 -1.831309 -1.013264
H  -4.782798 0.28869 2.149917
H  -5.646882 -0.610904 0.903345
H  -0.302064 -2.9548 -1.879903
H  -0.087491 -1.212256 -1.799428
H  0.652169 -2.261396 -0.571988
H  -3.421229 -1.736301 2.695615
H  -5.138755 -2.098537 2.780043
H  -4.209459 -2.629549 1.380779
elementType: Cl S P O N C H
totalener: -2420.15512514 hartree
nucrepener: 2462.88690508 hartree
electener: -4883.04203022 hartree
oneelecener: -8230.86708718 hartree
twoeener: 3347.82505696 hartree
cpcmener: -0.03220593 hartree
kineticenergy: 2413.94759536 hartree
xcener: -154.006045154869 hartree
chargesum: 0.0000000
charge: -0.094062 -0.139928 -0.432337 0.620017 -0.256881 -0.326904 -0.353700 -0.461200 -0.045835 0.063573 -0.089000 0.199610 0.441871 -0.247655 -0.177785 -0.123188 0.099940 0.023709 0.026816 -0.212502 -0.248496 0.157869 0.166822 0.152330 0.147924 0.143662 0.109900 0.103199 0.100622 0.111675 0.111637 0.062803 0.081213 0.084686 0.107199 0.092398
qa: -0.0941 -0.1399 -0.4323 0.6200 -0.2569 -0.3269 -0.3537 -0.4612 -0.0458 0.0636 -0.0890 0.1996 0.4419 -0.2477 -0.1778 -0.1232 0.0999 0.0237 0.0268 -0.2125 -0.2485 0.1579 0.1668 0.1523 0.1479 0.1437 0.1099 0.1032 0.1006 0.1117 0.1116 0.0628 0.0812 0.0847 0.1072 0.0924
va: 1.2043 2.2760 2.0285 5.4177 2.2012 2.0473 2.0897 2.0524 3.1949 3.7265 3.8955 3.8253 4.3030 3.9624 4.0704 4.0103 3.8272 3.8643 3.8534 3.9366 3.8868 1.0177 0.9995 1.0221 1.0104 1.0051 0.9931 0.9988 1.0084 0.9917 1.0098 1.0104 1.0025 1.0181 1.0090 1.0042
dispcorr: -0.022980886 hartree
energy: -2420.178106022228
dipole: -22.87715 21.88195 -0.99520 -10.30275 8.81450 -1.48825 3.87415 -2.92662 0.94752
magnitude: 2.02561 au
magnitude: 5.14870 debye
