program: Orca
programVersion: 5.0.2
elementType: Cl S S P O O O O N C C C C C C C C C C C C H H H H H H H H H H H H H H H
charge: 0
multiplicity: 1
keywords: wb97x-d3
keywords: def2-TZVPP
keywords: def2/J RIJCOSX
keywords: DEFGRID2
keywords: scfconv7
keywords: smallprint printgap noloewdin
keywords: NOSOSCF
formula: C12H15ClNO4PS2
InChI: InChI=1/C12H15ClNO4PS2/c1-3-16-19(20,17-4-2)21-8-14-10-6-5-9(13)7-11(10)18-12(14)15/h5-7H,3-4,8H2,1-2H3
36 atoms
Cl 5.301381 -1.60809 -0.310413
S  -0.90221 1.29726 1.808712
S  -2.813869 -1.364804 2.224566
P  -1.893403 -0.301067 0.915143
O  0.978946 0.346958 -2.290068
O  -0.702608 -0.993611 0.106204
O  -2.772447 0.316806 -0.270248
O  -0.939669 1.515887 -2.399499
N  0.471161 1.614839 -0.554593
C  1.655254 0.961919 -0.245505
C  -0.359201 2.313232 0.375304
C  1.952852 0.179592 -1.346849
C  0.046501 1.201826 -1.789729
C  2.479438 0.973837 0.858416
C  3.058434 -0.627504 -1.424869
C  3.611857 0.164558 0.81427
C  3.884532 -0.61287 -0.30333
C  -0.801701 -2.327877 -0.440869
C  -4.153847 0.700087 -0.10283
C  -1.703014 -2.406568 -1.647913
C  -4.325977 1.934563 0.747502
H  0.188636 3.13961 0.828182
H  -1.219594 2.725476 -0.144782
H  2.272989 1.578374 1.730143
H  3.268685 -1.233587 -2.294853
H  4.281158 0.145326 1.662786
H  0.222875 -2.586755 -0.701637
H  -1.131809 -3.010309 0.344736
H  -4.511953 0.873594 -1.115693
H  -4.709708 -0.142566 0.311663
H  -1.41874 -1.681659 -2.4106
H  -1.610537 -3.401842 -2.083366
H  -2.752088 -2.257913 -1.393494
H  -5.376638 2.225483 0.72661
H  -4.055383 1.760571 1.788695
H  -3.740591 2.772039 0.367513
elementType: Cl S P O N C H
totalener: -2420.15407071 hartree
nucrepener: 2511.35947193 hartree
electener: -4931.51354264 hartree
oneelecener: -8328.87214630 hartree
twoeener: 3397.35860367 hartree
cpcmener: -0.03456731 hartree
kineticenergy: 2413.96233055 hartree
xcener: -154.010229708974 hartree
chargesum: 0.0000000
charge: -0.093407 -0.152670 -0.433495 0.605312 -0.255627 -0.322748 -0.328941 -0.457803 -0.076209 0.056121 -0.054904 0.197030 0.406964 -0.187270 -0.191852 -0.139394 0.116610 0.016702 0.035485 -0.240027 -0.248168 0.173342 0.149475 0.159619 0.147329 0.144382 0.105277 0.106583 0.110570 0.097231 0.087436 0.105403 0.083282 0.106561 0.077726 0.094073
qa: -0.0934 -0.1527 -0.4335 0.6053 -0.2556 -0.3227 -0.3289 -0.4578 -0.0762 0.0561 -0.0549 0.1970 0.4070 -0.1873 -0.1919 -0.1394 0.1166 0.0167 0.0355 -0.2400 -0.2482 0.1733 0.1495 0.1596 0.1473 0.1444 0.1053 0.1066 0.1106 0.0972 0.0874 0.1054 0.0833 0.1066 0.0777 0.0941
va: 1.2069 2.2523 2.0429 5.4383 2.1884 2.0968 2.0709 2.0457 3.2125 3.7878 3.9056 3.8402 4.3334 4.0067 4.0787 4.0002 3.8147 3.8495 3.8351 3.9018 3.9094 0.9851 1.0138 0.9994 1.0104 1.0053 0.9902 1.0104 0.9915 1.0127 1.0104 1.0105 1.0126 1.0125 1.0158 1.0015
dispcorr: -0.023316077 hartree
energy: -2420.177386785550
dipole: -24.58104 25.00930 0.42827 3.19324 -2.06853 1.12471 -2.98058 3.03905 0.05847
magnitude: 1.20491 au
magnitude: 3.06263 debye
