program: Orca
programVersion: 5.0.2
elementType: Cl S S P O O O O N C C C C C C C C C C C C H H H H H H H H H H H H H H H
charge: 0
multiplicity: 1
keywords: wb97x-d3
keywords: def2-TZVPP
keywords: def2/J RIJCOSX
keywords: DEFGRID2
keywords: scfconv7
keywords: smallprint printgap noloewdin
keywords: NOSOSCF
formula: C12H15ClNO4PS2
InChI: InChI=1/C12H15ClNO4PS2/c1-3-16-19(20,17-4-2)21-8-14-10-6-5-9(13)7-11(10)18-12(14)15/h5-7H,3-4,8H2,1-2H3
36 atoms
Cl 5.198247 -1.877017 -0.737986
S  -1.156725 0.077329 2.012088
S  -3.329631 -1.976829 0.691299
P  -2.169536 -0.502382 0.278016
O  1.318913 1.376024 -1.641695
O  -1.06897 -0.706824 -0.861427
O  -2.822814 0.824469 -0.322256
O  -0.48634 2.655711 -1.234291
N  0.610075 1.484205 0.446162
C  1.701217 0.629452 0.434995
C  -0.311247 1.635978 1.527367
C  2.126339 0.577607 -0.880394
C  0.366466 1.91232 -0.830821
C  2.355115 -0.076536 1.42111
C  3.192272 -0.175848 -1.30039
C  3.445316 -0.849612 1.030747
C  3.842835 -0.893639 -0.299092
C  -0.628584 -2.009671 -1.304263
C  -3.863653 1.533347 0.382633
C  0.235548 -2.721251 -0.29506
C  -4.37203 2.628433 -0.517037
H  0.212628 1.94931 2.430237
H  -1.038305 2.404897 1.279732
H  2.047131 -0.047546 2.456766
H  3.50336 -0.208825 -2.3351
H  3.981195 -1.42225 1.774591
H  -1.50172 -2.609505 -1.564969
H  -0.073301 -1.809209 -2.218556
H  -4.66231 0.83633 0.644605
H  -3.456627 1.946883 1.308386
H  0.576428 -3.659494 -0.734748
H  1.117706 -2.140837 -0.028692
H  -0.310986 -2.965693 0.615997
H  -3.578351 3.326943 -0.784165
H  -4.808629 2.225725 -1.430862
H  -5.147341 3.187617 0.006834
elementType: Cl S P O N C H
totalener: -2420.15635685 hartree
nucrepener: 2508.41316865 hartree
electener: -4928.56952550 hartree
oneelecener: -8322.58432092 hartree
twoeener: 3394.01479542 hartree
cpcmener: -0.03745097 hartree
kineticenergy: 2413.95218648 hartree
xcener: -154.009655542891 hartree
chargesum: 0.0000000
charge: -0.092516 -0.158516 -0.431559 0.612520 -0.254723 -0.333021 -0.331793 -0.456491 -0.067909 0.027367 -0.060551 0.211261 0.414186 -0.192363 -0.186751 -0.119725 0.110102 0.034245 0.018063 -0.231820 -0.240287 0.176906 0.152628 0.153953 0.148641 0.142459 0.109697 0.110037 0.110432 0.103407 0.110292 0.058994 0.085239 0.085773 0.089917 0.091906
qa: -0.0925 -0.1585 -0.4316 0.6125 -0.2547 -0.3330 -0.3318 -0.4565 -0.0679 0.0274 -0.0606 0.2113 0.4142 -0.1924 -0.1868 -0.1197 0.1101 0.0342 0.0181 -0.2318 -0.2403 0.1769 0.1526 0.1540 0.1486 0.1425 0.1097 0.1100 0.1104 0.1034 0.1103 0.0590 0.0852 0.0858 0.0899 0.0919
va: 1.2064 2.2532 2.0382 5.4666 2.1930 2.0981 2.1083 2.0458 3.1947 3.7960 3.9040 3.8340 4.3291 3.9727 4.0744 3.9651 3.8116 3.8092 3.8368 3.8958 3.9625 0.9839 1.0075 1.0037 1.0102 1.0063 1.0121 0.9945 1.0055 0.9903 1.0121 1.0044 1.0251 1.0080 1.0046 1.0063
dispcorr: -0.023651858 hartree
energy: -2420.180008711827
dipole: -17.81790 19.00572 1.18782 4.96199 -4.42588 0.53611 1.80076 -0.25781 1.54295
magnitude: 2.01966 au
magnitude: 5.13357 debye
