program: Orca
programVersion: 5.0.2
elementType: Cl S S P O O O O N C C C C C C C C C C C C H H H H H H H H H H H H H H H
charge: 0
multiplicity: 1
keywords: wb97x-d3
keywords: def2-TZVPP
keywords: def2/J RIJCOSX
keywords: DEFGRID2
keywords: scfconv7
keywords: smallprint printgap noloewdin
keywords: NOSOSCF
formula: C12H15ClNO4PS2
InChI: InChI=1/C12H15ClNO4PS2/c1-3-16-19(20,17-4-2)21-8-14-10-6-5-9(13)7-11(10)18-12(14)15/h5-7H,3-4,8H2,1-2H3
36 atoms
Cl 4.882198 -2.087956 -1.113006
S  -0.750639 0.91213 2.210919
S  -3.048712 -1.436508 2.10469
P  -2.062838 -0.186325 1.02823
O  0.819656 0.890445 -2.133426
O  -1.216623 -0.819235 -0.177155
O  -2.8601 0.963787 0.26958
O  -0.916063 2.273756 -1.763171
N  0.568854 1.666013 -0.082005
C  1.663378 0.81474 -0.060118
C  -0.095192 2.193315 1.066447
C  1.800697 0.345338 -1.354181
C  0.039164 1.677727 -1.344721
C  2.525215 0.410504 0.936533
C  2.76909 -0.547336 -1.735316
C  3.52169 -0.495551 0.584003
C  3.630751 -0.958237 -0.721302
C  -0.4293 -2.019477 -0.017999
C  -3.842305 0.653547 -0.747878
C  -0.298689 -2.690217 -1.360033
C  -4.575817 1.922955 -1.089308
H  0.602464 2.764915 1.678546
H  -0.890312 2.863702 0.751912
H  2.444953 0.767597 1.953507
H  2.851599 -0.909661 -2.750116
H  4.214314 -0.839463 1.339145
H  0.545796 -1.743463 0.388573
H  -0.917401 -2.684663 0.697619
H  -3.333893 0.245704 -1.622494
H  -4.52855 -0.104722 -0.364287
H  0.162924 -2.0367 -2.100403
H  0.334581 -3.571356 -1.252823
H  -1.268497 -3.016511 -1.737094
H  -5.108059 2.323816 -0.226645
H  -3.898059 2.686593 -1.470567
H  -5.308868 1.708644 -1.866509
elementType: Cl S P O N C H
totalener: -2420.15742736 hartree
nucrepener: 2508.89162342 hartree
electener: -4929.04905078 hartree
oneelecener: -8323.26026397 hartree
twoeener: 3394.21121319 hartree
cpcmener: -0.03372294 hartree
kineticenergy: 2413.94848667 hartree
xcener: -154.005889165031 hartree
chargesum: -0.0000000
charge: -0.091770 -0.151906 -0.437416 0.610607 -0.254632 -0.324777 -0.335002 -0.458003 -0.072630 0.025128 -0.064678 0.221791 0.419685 -0.177889 -0.223736 -0.137839 0.134617 0.025513 0.015933 -0.259842 -0.237625 0.178105 0.150876 0.155447 0.149353 0.143766 0.108027 0.117748 0.115179 0.105201 0.090725 0.097145 0.097510 0.089363 0.085148 0.090877
qa: -0.0918 -0.1519 -0.4374 0.6106 -0.2546 -0.3248 -0.3350 -0.4580 -0.0726 0.0251 -0.0647 0.2218 0.4197 -0.1779 -0.2237 -0.1378 0.1346 0.0255 0.0159 -0.2598 -0.2376 0.1781 0.1509 0.1554 0.1494 0.1438 0.1080 0.1177 0.1152 0.1052 0.0907 0.0971 0.0975 0.0894 0.0851 0.0909
va: 1.2085 2.2685 2.0427 5.4444 2.1889 2.0620 2.0956 2.0457 3.2030 3.7923 3.9026 3.7844 4.3211 3.9807 4.0602 4.0073 3.7967 3.8104 3.8325 3.9401 3.9505 0.9817 1.0185 1.0018 1.0102 1.0059 0.9861 1.0156 0.9959 1.0060 1.0010 1.0055 1.0075 1.0040 1.0094 1.0070
dispcorr: -0.023724319 hartree
energy: -2420.181151682080
dipole: -17.72148 19.37666 1.65518 1.79156 -1.42972 0.36185 -5.52073 5.48534 -0.03539
magnitude: 1.69464 au
magnitude: 4.30743 debye
