program: Orca
programVersion: 5.0.2
elementType: Cl S S P O O O O N C C C C C C C C C C C C H H H H H H H H H H H H H H H
charge: 0
multiplicity: 1
keywords: wb97x-d3
keywords: def2-TZVPP
keywords: def2/J RIJCOSX
keywords: DEFGRID2
keywords: scfconv7
keywords: smallprint printgap noloewdin
keywords: NOSOSCF
formula: C12H15ClNO4PS2
InChI: InChI=1/C12H15ClNO4PS2/c1-3-16-19(20,17-4-2)21-8-14-10-6-5-9(13)7-11(10)18-12(14)15/h5-7H,3-4,8H2,1-2H3
36 atoms
Cl 4.685775 0.481642 2.295502
S  -2.107385 0.043385 -1.849866
S  -0.693405 -2.651211 -0.28455
P  -1.75464 -1.054945 -0.112573
O  0.903461 2.81516 -0.28597
O  -3.251365 -1.243237 0.419169
O  -1.190543 0.089846 0.84922
O  -0.790053 3.082637 -1.751156
N  0.409289 1.108829 -1.59628
C  1.443964 0.693282 -0.767334
C  -0.39891 0.292927 -2.45333
C  1.73941 1.782361 0.03397
C  0.071002 2.392685 -1.276482
C  2.158351 -0.479701 -0.652287
C  2.720716 1.77383 0.992487
C  3.161831 -0.524096 0.311188
C  3.427669 0.580592 1.110224
C  -3.996222 -2.469417 0.256858
C  -0.537967 -0.234164 2.100078
C  -4.495096 -2.656603 -1.153793
C  -0.510919 1.013123 2.944274
H  -0.513707 0.760384 -3.43059
H  0.089172 -0.667912 -2.600888
H  1.955964 -1.341432 -1.271082
H  2.92659 2.634931 1.612912
H  3.73895 -1.43034 0.431213
H  -3.378441 -3.312314 0.571227
H  -4.825593 -2.381695 0.956221
H  -1.079815 -1.032485 2.610787
H  0.470669 -0.589807 1.884095
H  -5.125911 -3.544901 -1.188767
H  -5.093944 -1.807946 -1.484215
H  -3.678139 -2.805731 -1.860518
H  0.010329 1.829393 2.443886
H  -1.516943 1.346733 3.199201
H  0.017528 0.800487 3.873559
elementType: Cl S P O N C H
totalener: -2420.15371716 hartree
nucrepener: 2505.14127917 hartree
electener: -4925.29499632 hartree
oneelecener: -8316.05273095 hartree
twoeener: 3390.75773463 hartree
cpcmener: -0.03337340 hartree
kineticenergy: 2413.96181255 hartree
xcener: -154.008921076272 hartree
chargesum: 0.0000000
charge: -0.094131 -0.137687 -0.442370 0.650670 -0.258164 -0.366111 -0.339410 -0.455058 -0.060182 0.028911 -0.061278 0.229719 0.425908 -0.192696 -0.226574 -0.151166 0.145616 0.043812 0.005815 -0.252638 -0.260682 0.171100 0.151408 0.144968 0.148138 0.142431 0.095781 0.110710 0.132600 0.111335 0.103387 0.093786 0.078021 0.090175 0.097616 0.096241
qa: -0.0941 -0.1377 -0.4424 0.6507 -0.2582 -0.3661 -0.3394 -0.4551 -0.0602 0.0289 -0.0613 0.2297 0.4259 -0.1927 -0.2266 -0.1512 0.1456 0.0438 0.0058 -0.2526 -0.2607 0.1711 0.1514 0.1450 0.1481 0.1424 0.0958 0.1107 0.1326 0.1113 0.1034 0.0938 0.0780 0.0902 0.0976 0.0962
va: 1.2056 2.2743 1.9957 5.4105 2.1881 2.1059 2.0808 2.0586 3.1926 3.7629 3.9133 3.7715 4.3371 3.9709 4.0623 4.0118 3.7822 3.8427 3.8187 3.8913 3.9595 0.9923 1.0134 1.0146 1.0107 1.0069 1.0141 0.9921 0.9979 0.9886 1.0108 1.0034 1.0177 1.0014 1.0058 1.0048
dispcorr: -0.023235473 hartree
energy: -2420.176952630154
dipole: -19.70941 19.90634 0.19694 -10.59356 8.79220 -1.80136 2.51837 -2.28549 0.23288
magnitude: 1.82700 au
magnitude: 4.64386 debye
