program: Orca
programVersion: 5.0.2
elementType: Cl S S P O O O O N C C C C C C C C C C C C H H H H H H H H H H H H H H H
charge: 0
multiplicity: 1
keywords: wb97x-d3
keywords: def2-TZVPP
keywords: def2/J RIJCOSX
keywords: DEFGRID2
keywords: scfconv7
keywords: smallprint printgap noloewdin
keywords: NOSOSCF
formula: C12H15ClNO4PS2
InChI: InChI=1/C12H15ClNO4PS2/c1-3-16-19(20,17-4-2)21-8-14-10-6-5-9(13)7-11(10)18-12(14)15/h5-7H,3-4,8H2,1-2H3
36 atoms
Cl 5.607789 -0.107945 1.179026
S  -1.017294 -1.382924 -1.430237
S  -2.971108 -2.317033 1.000291
P  -2.105988 -0.775871 0.246173
O  1.163615 2.305544 0.238049
O  -2.998266 0.455411 -0.234256
O  -1.11941 0.059693 1.18387
O  -0.85892 2.703123 -0.667259
N  0.471752 0.921215 -1.335444
C  1.708197 0.461392 -0.910619
C  -0.441398 0.198128 -2.16249
C  2.122767 1.345647 0.069407
C  0.132192 2.027691 -0.606263
C  2.491809 -0.611323 -1.275904
C  3.309956 1.222028 0.744316
C  3.703474 -0.768934 -0.608476
C  4.093347 0.130483 0.374881
C  -4.09047 0.269567 -1.162252
C  -0.477833 -0.512612 2.345366
C  -5.409946 0.352093 -0.439503
C  0.587557 -1.525693 2.00879
H  -1.285346 0.833271 -2.418166
H  0.045717 -0.093638 -3.092835
H  2.194811 -1.314106 -2.041818
H  3.612358 1.920453 1.51203
H  4.343454 -1.601834 -0.863574
H  -3.991154 1.065075 -1.899421
H  -3.990321 -0.681718 -1.690418
H  -0.050025 0.342841 2.86421
H  -1.24182 -0.949658 2.989878
H  -6.219932 0.304251 -1.167667
H  -5.535483 -0.473807 0.260163
H  -5.506734 1.29143 0.10489
H  0.178005 -2.411394 1.52339
H  1.366799 -1.107686 1.372847
H  1.057896 -1.849438 2.937881
elementType: Cl S P O N C H
totalener: -2420.15581702 hartree
nucrepener: 2494.78291108 hartree
electener: -4914.93872810 hartree
oneelecener: -8295.37779293 hartree
twoeener: 3380.43906483 hartree
cpcmener: -0.03823606 hartree
kineticenergy: 2413.95926477 hartree
xcener: -154.011351045098 hartree
chargesum: -0.0000000
charge: -0.092380 -0.154441 -0.433128 0.613319 -0.256887 -0.338791 -0.338958 -0.457191 -0.057078 0.020121 -0.062603 0.208769 0.412411 -0.186158 -0.184135 -0.124429 0.109801 0.043168 0.037463 -0.235343 -0.232267 0.151582 0.175871 0.155107 0.148912 0.143466 0.108239 0.089351 0.110830 0.109254 0.095424 0.074019 0.090530 0.084163 0.061432 0.110559
qa: -0.0924 -0.1544 -0.4331 0.6133 -0.2569 -0.3388 -0.3390 -0.4572 -0.0571 0.0201 -0.0626 0.2088 0.4124 -0.1862 -0.1841 -0.1244 0.1098 0.0432 0.0375 -0.2353 -0.2323 0.1516 0.1759 0.1551 0.1489 0.1435 0.1082 0.0894 0.1108 0.1093 0.0954 0.0740 0.0905 0.0842 0.0614 0.1106
va: 1.2066 2.2575 2.0314 5.4694 2.1921 2.0979 2.0950 2.0510 3.1923 3.8076 3.9047 3.8288 4.3370 3.9768 4.0755 3.9794 3.8227 3.8431 3.8060 3.9565 3.8963 1.0110 0.9835 1.0018 1.0101 1.0056 0.9928 1.0057 0.9951 1.0129 1.0069 1.0178 1.0042 1.0242 1.0070 1.0120
dispcorr: -0.023262752 hartree
energy: -2420.179079773376
dipole: -20.61091 21.69649 1.08557 -2.79399 2.28568 -0.50831 -1.62099 -0.03611 -1.65710
magnitude: 2.04519 au
magnitude: 5.19847 debye
