program: Orca
programVersion: 5.0.2
elementType: Cl S S P O O O O N C C C C C C C C C C C C H H H H H H H H H H H H H H H
charge: 0
multiplicity: 1
keywords: wb97x-d3
keywords: def2-TZVPP
keywords: def2/J RIJCOSX
keywords: DEFGRID2
keywords: scfconv7
keywords: smallprint printgap noloewdin
keywords: NOSOSCF
formula: C12H15ClNO4PS2
InChI: InChI=1/C12H15ClNO4PS2/c1-3-16-19(20,17-4-2)21-8-14-10-6-5-9(13)7-11(10)18-12(14)15/h5-7H,3-4,8H2,1-2H3
36 atoms
Cl 5.007697 -1.905922 -0.95491
S  -1.267074 0.439341 2.052975
S  -3.621774 -1.548046 0.94366
P  -2.171648 -0.421843 0.37544
O  1.246917 1.493341 -1.814478
O  -0.996289 -1.111311 -0.461583
O  -2.471527 0.751432 -0.657643
O  -0.477852 2.873744 -1.384885
N  0.515343 1.570888 0.265188
C  1.57246 0.674817 0.245093
C  -0.327759 1.867837 1.377984
C  2.014998 0.646126 -1.0657
C  0.319968 2.064471 -0.996115
C  2.185543 -0.085778 1.216571
C  3.067739 -0.122149 -1.491726
C  3.253258 -0.885486 0.816705
C  3.676347 -0.894897 -0.505504
C  -0.364176 -2.317668 0.012732
C  -3.751528 1.413649 -0.746186
C  0.433591 -2.910073 -1.118913
C  -3.987348 2.381704 0.385264
H  0.267162 2.213151 2.223909
H  -1.01428 2.663177 1.102751
H  1.863019 -0.078597 2.247898
H  3.395236 -0.130446 -2.52188
H  3.755723 -1.500822 1.549634
H  0.276391 -2.074344 0.862368
H  -1.129179 -3.019168 0.352485
H  -3.724189 1.930805 -1.703076
H  -4.540237 0.661174 -0.792243
H  1.19089 -2.219497 -1.488431
H  0.943994 -3.804048 -0.761295
H  -0.208636 -3.201362 -1.950056
H  -3.20225 3.135684 0.440074
H  -4.931414 2.898067 0.209101
H  -4.063182 1.878916 1.349497
elementType: Cl S P O N C H
totalener: -2420.15477917 hartree
nucrepener: 2516.27893546 hartree
electener: -4936.43371463 hartree
oneelecener: -8338.04622374 hartree
twoeener: 3401.61250911 hartree
cpcmener: -0.03478538 hartree
kineticenergy: 2413.95844303 hartree
xcener: -154.011609350098 hartree
chargesum: 0.0000000
charge: -0.092881 -0.162324 -0.432149 0.610778 -0.252244 -0.329809 -0.330186 -0.460460 -0.057694 0.026913 -0.071459 0.226222 0.425227 -0.220175 -0.183507 -0.114855 0.095430 0.004796 0.020622 -0.264710 -0.249391 0.179814 0.160434 0.155671 0.145344 0.144341 0.115588 0.122210 0.114096 0.102786 0.090621 0.096682 0.099894 0.090087 0.109265 0.085024
qa: -0.0929 -0.1623 -0.4321 0.6108 -0.2522 -0.3298 -0.3302 -0.4605 -0.0577 0.0269 -0.0715 0.2262 0.4252 -0.2202 -0.1835 -0.1149 0.0954 0.0048 0.0206 -0.2647 -0.2494 0.1798 0.1604 0.1557 0.1453 0.1443 0.1156 0.1222 0.1141 0.1028 0.0906 0.0967 0.0999 0.0901 0.1093 0.0850
va: 1.2051 2.2441 2.0413 5.4730 2.2045 2.0936 2.1134 2.0471 3.1834 3.7528 3.8962 3.8505 4.3251 3.9535 4.0359 3.9658 3.8119 3.8100 3.8323 3.9552 3.8889 0.9848 0.9993 1.0050 1.0120 1.0049 0.9861 1.0101 0.9930 1.0136 0.9991 1.0053 1.0085 1.0065 1.0123 1.0137
dispcorr: -0.024304825 hartree
energy: -2420.179083995572
dipole: -15.22506 16.53074 1.30567 2.70821 -2.37780 0.33042 2.26265 -0.85151 1.41114
magnitude: 1.95071 au
magnitude: 4.95831 debye
