program: Orca
programVersion: 5.0.2
elementType: Cl S S P O O O O N C C C C C C C C C C C C H H H H H H H H H H H H H H H
charge: 0
multiplicity: 1
keywords: wb97x-d3
keywords: def2-TZVPP
keywords: def2/J RIJCOSX
keywords: DEFGRID2
keywords: scfconv7
keywords: smallprint printgap noloewdin
keywords: NOSOSCF
formula: C12H15ClNO4PS2
InChI: InChI=1/C12H15ClNO4PS2/c1-3-16-19(20,17-4-2)21-8-14-10-6-5-9(13)7-11(10)18-12(14)15/h5-7H,3-4,8H2,1-2H3
36 atoms
Cl 5.108931 -1.821244 -0.641635
S  -0.801411 1.287103 2.002126
S  -2.70743 -1.377431 2.373875
P  -1.780694 -0.301573 1.079736
O  0.841097 0.529883 -2.274683
O  -0.610685 -0.995958 0.248857
O  -2.653997 0.3449 -0.096801
O  -0.999135 1.822032 -2.217629
N  0.465017 1.664293 -0.419048
C  1.625076 0.931998 -0.216255
C  -0.282304 2.347038 0.588953
C  1.838268 0.232136 -1.389942
C  -0.019846 1.392202 -1.670669
C  2.485928 0.804478 0.850967
C  2.892013 -0.623482 -1.579963
C  3.56705 -0.059347 0.69407
C  3.754952 -0.75236 -0.494142
C  -0.712625 -2.331404 -0.293855
C  -3.858936 1.081857 0.196326
C  -1.621934 -2.40458 -1.494978
C  -4.58135 1.339374 -1.09939
H  0.322539 3.126404 1.052723
H  -1.149062 2.821138 0.136493
H  2.344886 1.342224 1.777571
H  3.036651 -1.162558 -2.50582
H  4.263295 -0.187958 1.510686
H  0.309951 -2.590257 -0.56231
H  -1.037903 -3.013392 0.493914
H  -4.480228 0.501388 0.881417
H  -3.591918 2.018769 0.690911
H  -1.335754 -1.681725 -2.259013
H  -1.541536 -3.400573 -1.930835
H  -2.667831 -2.245759 -1.233337
H  -3.979399 1.932754 -1.786975
H  -4.863397 0.408879 -1.591486
H  -5.494042 1.895698 -0.888143
elementType: Cl S P O N C H
totalener: -2420.15495990 hartree
nucrepener: 2513.83597469 hartree
electener: -4933.99093458 hartree
oneelecener: -8333.62514007 hartree
twoeener: 3399.63420549 hartree
cpcmener: -0.03425895 hartree
kineticenergy: 2413.96765183 hartree
xcener: -154.009506853092 hartree
chargesum: 0.0000000
charge: -0.093898 -0.158091 -0.434609 0.600625 -0.256451 -0.319402 -0.317150 -0.460721 -0.080560 0.047144 -0.055364 0.210740 0.417316 -0.178478 -0.207130 -0.142969 0.123865 0.017503 0.024398 -0.236714 -0.245329 0.177913 0.148352 0.158325 0.148507 0.144119 0.102976 0.108266 0.105343 0.105498 0.088648 0.105391 0.080705 0.086370 0.090402 0.094463
qa: -0.0939 -0.1581 -0.4346 0.6006 -0.2565 -0.3194 -0.3172 -0.4607 -0.0806 0.0471 -0.0554 0.2107 0.4173 -0.1785 -0.2071 -0.1430 0.1239 0.0175 0.0244 -0.2367 -0.2453 0.1779 0.1484 0.1583 0.1485 0.1441 0.1030 0.1083 0.1053 0.1055 0.0886 0.1054 0.0807 0.0864 0.0904 0.0945
va: 1.2062 2.2613 2.0465 5.4507 2.1881 2.0927 2.0709 2.0393 3.2080 3.7947 3.8994 3.8173 4.3179 4.0031 4.0811 4.0059 3.8081 3.8522 3.8316 3.9003 3.9612 0.9833 1.0125 0.9999 1.0105 1.0056 0.9900 1.0096 1.0100 0.9894 1.0089 1.0104 1.0163 1.0089 1.0033 1.0070
dispcorr: -0.023330359 hartree
energy: -2420.178290255171
dipole: -24.05127 24.72777 0.67650 2.62710 -1.52847 1.09863 -6.07668 6.14322 0.06654
magnitude: 1.29193 au
magnitude: 3.28382 debye
