program: Orca
programVersion: 5.0.2
elementType: Cl S S P O O O O N C C C C C C C C C C C C H H H H H H H H H H H H H H H
charge: 0
multiplicity: 1
keywords: wb97x-d3
keywords: def2-TZVPP
keywords: def2/J RIJCOSX
keywords: DEFGRID2
keywords: scfconv7
keywords: smallprint printgap noloewdin
keywords: NOSOSCF
formula: C12H15ClNO4PS2
InChI: InChI=1/C12H15ClNO4PS2/c1-3-16-19(20,17-4-2)21-8-14-10-6-5-9(13)7-11(10)18-12(14)15/h5-7H,3-4,8H2,1-2H3
36 atoms
Cl 5.120442 -2.061261 -0.756154
S  -1.048944 0.308617 2.060829
S  -3.304448 -1.743762 0.894045
P  -2.102281 -0.337196 0.374561
O  1.369268 1.322719 -1.713481
O  -1.024299 -0.654367 -0.760233
O  -2.708124 0.977339 -0.295275
O  -0.366423 2.700829 -1.322493
N  0.728592 1.568644 0.385406
C  1.78053 0.665418 0.388346
C  -0.163205 1.808217 1.476733
C  2.161692 0.526504 -0.934362
C  0.467499 1.943692 -0.905276
C  2.433477 -0.019155 1.39035
C  3.177742 -0.297333 -1.34562
C  3.473154 -0.863225 1.008799
C  3.826155 -0.993814 -0.328118
C  -0.650174 -2.001529 -1.127342
C  -3.769101 1.716386 0.351745
C  0.195334 -2.689127 -0.086225
C  -5.05114 1.557473 -0.422658
H  0.390143 2.151635 2.351306
H  -0.870414 2.587197 1.203025
H  2.160465 0.076605 2.431834
H  3.45404 -0.396796 -2.386012
H  4.004944 -1.422687 1.765543
H  -1.553968 -2.574749 -1.339116
H  -0.100596 -1.884203 -2.059247
H  -3.895649 1.386796 1.38602
H  -3.442748 2.755593 0.374332
H  0.499836 -3.661151 -0.475831
H  1.098478 -2.125914 0.143853
H  -0.353655 -2.8638 0.839166
H  -5.395116 0.523434 -0.416033
H  -5.824924 2.173531 0.035728
H  -4.935268 1.882292 -1.45658
elementType: Cl S P O N C H
totalener: -2420.15492575 hartree
nucrepener: 2510.20085181 hartree
electener: -4930.35577756 hartree
oneelecener: -8326.21986165 hartree
twoeener: 3395.86408409 hartree
cpcmener: -0.03674553 hartree
kineticenergy: 2413.95258090 hartree
xcener: -154.009924214142 hartree
chargesum: -0.0000000
charge: -0.092600 -0.157117 -0.432662 0.614478 -0.254738 -0.332355 -0.339366 -0.455205 -0.072204 0.031829 -0.056326 0.210632 0.413865 -0.195318 -0.184973 -0.115964 0.107134 0.031678 0.044834 -0.234019 -0.233629 0.175322 0.150995 0.153442 0.148638 0.142046 0.109713 0.110561 0.088996 0.105659 0.110292 0.061039 0.085157 0.074166 0.094927 0.091072
qa: -0.0926 -0.1571 -0.4327 0.6145 -0.2547 -0.3324 -0.3394 -0.4552 -0.0722 0.0318 -0.0563 0.2106 0.4139 -0.1953 -0.1850 -0.1160 0.1071 0.0317 0.0448 -0.2340 -0.2336 0.1753 0.1510 0.1534 0.1486 0.1420 0.1097 0.1106 0.0890 0.1057 0.1103 0.0610 0.0852 0.0742 0.0949 0.0911
va: 1.2065 2.2544 2.0308 5.4680 2.1920 2.0974 2.0982 2.0519 3.1941 3.7922 3.9036 3.8341 4.3348 3.9735 4.0713 3.9574 3.8118 3.8103 3.8396 3.8947 3.9606 0.9838 1.0109 1.0040 1.0100 1.0064 1.0130 0.9940 1.0071 0.9941 1.0121 1.0034 1.0260 1.0167 1.0068 1.0043
dispcorr: -0.023715755 hartree
energy: -2420.178641509291
dipole: -19.50245 20.64151 1.13905 2.62226 -2.14274 0.47952 2.28779 -0.81368 1.47410
magnitude: 1.92363 au
magnitude: 4.88948 debye
