program: Orca
programVersion: 5.0.2
elementType: Cl S S P O O O O N C C C C C C C C C C C C H H H H H H H H H H H H H H H
charge: 0
multiplicity: 1
keywords: wb97x-d3
keywords: def2-TZVPP
keywords: def2/J RIJCOSX
keywords: DEFGRID2
keywords: scfconv7
keywords: smallprint printgap noloewdin
keywords: NOSOSCF
formula: C12H15ClNO4PS2
InChI: InChI=1/C12H15ClNO4PS2/c1-3-16-19(20,17-4-2)21-8-14-10-6-5-9(13)7-11(10)18-12(14)15/h5-7H,3-4,8H2,1-2H3
36 atoms
Cl 5.280664 0.940322 1.47229
S  -0.786053 -1.852534 -1.257717
S  -2.577701 -2.447628 1.432979
P  -1.929847 -1.049091 0.285539
O  0.727068 2.407996 -0.397657
O  -3.028283 -0.079319 -0.357974
O  -0.910706 0.013809 0.902421
O  -1.217678 2.295954 -1.522589
N  0.374312 0.609648 -1.624095
C  1.596194 0.434568 -0.995799
C  -0.373186 -0.396634 -2.303209
C  1.794831 1.577689 -0.240479
C  -0.166369 1.804395 -1.223089
C  2.530021 -0.578547 -1.003924
C  2.907296 1.787833 0.532876
C  3.671555 -0.398636 -0.226621
C  3.84677 0.759273 0.518859
C  -4.354044 -0.516275 -0.714981
C  -1.197844 0.70475 2.141783
C  -4.374759 -1.420448 -1.922369
C  -0.111134 0.397818 3.137924
H  -1.276915 0.042819 -2.718077
H  0.206659 -0.81403 -3.127119
H  2.400055 -1.482569 -1.582201
H  3.04109 2.688046 1.116465
H  4.424568 -1.174253 -0.206778
H  -4.814952 -1.002805 0.146717
H  -4.900097 0.404939 -0.912396
H  -1.240722 1.767692 1.90549
H  -2.1754 0.41094 2.530484
H  -3.906359 -2.384719 -1.725459
H  -5.413501 -1.610802 -2.195815
H  -3.884737 -0.961074 -2.781409
H  -0.291315 0.960228 4.054697
H  -0.093503 -0.662176 3.392083
H  0.871396 0.681942 2.758747
elementType: Cl S P O N C H
totalener: -2420.16426006 hartree
nucrepener: 2496.81650069 hartree
electener: -4916.98076075 hartree
oneelecener: -8299.69469740 hartree
twoeener: 3382.71393665 hartree
cpcmener: -0.02913004 hartree
kineticenergy: 2413.97187691 hartree
xcener: -154.009643538449 hartree
chargesum: -0.0000000
charge: -0.091583 -0.146828 -0.430576 0.608970 -0.252615 -0.323616 -0.325786 -0.425907 -0.077104 0.056511 -0.063030 0.193263 0.395050 -0.179503 -0.210413 -0.141279 0.126086 0.035773 0.017537 -0.249320 -0.228492 0.146899 0.170531 0.155994 0.145784 0.141522 0.094175 0.108573 0.109016 0.101427 0.078339 0.104513 0.092296 0.095132 0.081210 0.087449
qa: -0.0916 -0.1468 -0.4306 0.6090 -0.2526 -0.3236 -0.3258 -0.4259 -0.0771 0.0565 -0.0630 0.1933 0.3951 -0.1795 -0.2104 -0.1413 0.1261 0.0358 0.0175 -0.2493 -0.2285 0.1469 0.1705 0.1560 0.1458 0.1415 0.0942 0.1086 0.1090 0.1014 0.0783 0.1045 0.0923 0.0951 0.0812 0.0874
va: 1.2090 2.2560 2.0368 5.4446 2.1930 2.0887 2.0901 2.0913 3.2057 3.8041 3.9079 3.8419 4.3544 4.0067 4.0586 4.0087 3.8141 3.8529 3.8349 3.9018 3.9533 1.0180 0.9849 1.0005 1.0115 1.0065 1.0127 0.9913 1.0005 1.0094 1.0152 1.0128 1.0018 1.0094 1.0125 0.9964
dispcorr: -0.022738100 hartree
energy: -2420.186998159454
dipole: -21.52463 21.80120 0.27657 -2.82822 2.79968 -0.02854 -1.48800 0.32688 -1.16112
magnitude: 1.19395 au
magnitude: 3.03477 debye
