program: Orca
programVersion: 5.0.2
elementType: Cl S S P O O O O N C C C C C C C C C C C C H H H H H H H H H H H H H H H
charge: 0
multiplicity: 1
keywords: wb97x-d3
keywords: def2-TZVPP
keywords: def2/J RIJCOSX
keywords: DEFGRID2
keywords: scfconv7
keywords: smallprint printgap noloewdin
keywords: NOSOSCF
formula: C12H15ClNO4PS2
InChI: InChI=1/C12H15ClNO4PS2/c1-3-16-19(20,17-4-2)21-8-14-10-6-5-9(13)7-11(10)18-12(14)15/h5-7H,3-4,8H2,1-2H3
36 atoms
Cl 5.387993 1.24139 -2.418305
S  -0.612168 -1.922165 0.461575
S  -3.311121 -0.465175 1.968787
P  -2.350642 -0.769791 0.329989
O  1.410591 2.238366 0.678969
O  -3.127115 -1.557599 -0.826496
O  -1.802939 0.519435 -0.438134
O  -0.296025 1.866763 2.096281
N  0.997315 0.144637 1.227716
C  2.067909 0.125956 0.349051
C  0.315968 -1.000279 1.741038
C  2.309203 1.45097 0.026306
C  0.590858 1.438905 1.413643
C  2.845435 -0.883347 -0.176575
C  3.312423 1.851436 -0.81814
C  3.873944 -0.510755 -1.038545
C  4.094163 0.825113 -1.344449
C  -4.218126 -2.465679 -0.571015
C  -2.618354 1.70694 -0.571714
C  -3.74185 -3.803634 -0.065226
C  -1.870319 2.687392 -1.435727
H  1.034822 -1.710899 2.147677
H  -0.353961 -0.702631 2.546483
H  2.683749 -1.925719 0.060774
H  3.483574 2.892073 -1.055984
H  4.505053 -1.275838 -1.468843
H  -4.917518 -2.005167 0.128865
H  -4.721829 -2.567409 -1.531264
H  -3.576926 1.44287 -1.024146
H  -2.811909 2.121691 0.418772
H  -3.024576 -4.260071 -0.74782
H  -3.288076 -3.730399 0.92374
H  -4.597281 -4.475563 0.015988
H  -2.468454 3.592758 -1.543393
H  -0.916535 2.971061 -0.990451
H  -1.686583 2.288153 -2.43331
elementType: Cl S P O N C H
totalener: -2420.16580811 hartree
nucrepener: 2425.36816481 hartree
electener: -4845.53397292 hartree
oneelecener: -8157.13172748 hartree
twoeener: 3311.59775457 hartree
cpcmener: -0.02876824 hartree
kineticenergy: 2413.95567493 hartree
xcener: -154.003649672059 hartree
chargesum: -0.0000000
charge: -0.091995 -0.152008 -0.439791 0.651220 -0.255404 -0.357810 -0.338174 -0.422555 -0.054357 0.049456 -0.072330 0.202074 0.386088 -0.176540 -0.191973 -0.138952 0.107937 0.042394 0.002716 -0.248770 -0.245762 0.172552 0.148964 0.155864 0.146544 0.142461 0.094764 0.108039 0.126774 0.107790 0.093137 0.077545 0.101678 0.092709 0.086161 0.089550
qa: -0.0920 -0.1520 -0.4398 0.6512 -0.2554 -0.3578 -0.3382 -0.4226 -0.0544 0.0495 -0.0723 0.2021 0.3861 -0.1765 -0.1920 -0.1390 0.1079 0.0424 0.0027 -0.2488 -0.2458 0.1726 0.1490 0.1559 0.1465 0.1425 0.0948 0.1080 0.1268 0.1078 0.0931 0.0775 0.1017 0.0927 0.0862 0.0895
va: 1.2080 2.2630 2.0066 5.4201 2.1964 2.1074 2.0978 2.0979 3.1986 3.8489 3.8919 3.8814 4.3635 3.9938 4.0924 4.0076 3.8335 3.8500 3.8291 3.8922 3.9609 0.9846 1.0312 1.0011 1.0103 1.0061 1.0147 0.9916 0.9918 1.0062 1.0028 1.0180 1.0115 1.0073 1.0078 1.0039
dispcorr: -0.020274102 hartree
energy: -2420.186082209681
dipole: -24.71060 25.06621 0.35561 -7.89619 6.28055 -1.61564 -1.65967 0.64835 -1.01132
magnitude: 1.93895 au
magnitude: 4.92841 debye
