program: Orca
programVersion: 5.0.2
elementType: Cl S S P O O O O N C C C C C C C C C C C C H H H H H H H H H H H H H H H
charge: 0
multiplicity: 1
keywords: wb97x-d3
keywords: def2-TZVPP
keywords: def2/J RIJCOSX
keywords: DEFGRID2
keywords: scfconv7
keywords: smallprint printgap noloewdin
keywords: NOSOSCF
formula: C12H15ClNO4PS2
InChI: InChI=1/C12H15ClNO4PS2/c1-3-16-19(20,17-4-2)21-8-14-10-6-5-9(13)7-11(10)18-12(14)15/h5-7H,3-4,8H2,1-2H3
36 atoms
Cl 5.018676 -1.881259 -0.763021
S  -1.064835 0.827985 2.065189
S  -3.114036 -1.689271 1.492728
P  -2.017377 -0.359951 0.640719
O  1.079715 1.152138 -2.048788
O  -0.776429 -0.852505 -0.231117
O  -2.736536 0.616705 -0.401073
O  -0.705451 2.495565 -1.804085
N  0.53071 1.729353 0.007627
C  1.633094 0.896292 0.105107
C  -0.290937 2.179171 1.082627
C  1.954318 0.549801 -1.196366
C  0.186392 1.863234 -1.313714
C  2.359013 0.402446 1.166789
C  2.987515 -0.289732 -1.522708
C  3.415249 -0.456389 0.871119
C  3.711643 -0.790903 -0.442963
C  -0.826282 -2.007015 -1.099674
C  -4.101595 1.057328 -0.268087
C  0.135648 -3.050487 -0.595973
C  -4.297019 2.05677 0.844964
H  0.298877 2.734151 1.812943
H  -1.058206 2.843302 0.692047
H  2.132321 0.653795 2.193243
H  3.214861 -0.551198 -2.546835
H  4.00356 -0.866847 1.679923
H  -1.84197 -2.40379 -1.154591
H  -0.551226 -1.656441 -2.094209
H  -4.337649 1.502866 -1.233235
H  -4.746724 0.187249 -0.131165
H  0.154895 -3.890907 -1.29076
H  1.150153 -2.656146 -0.522296
H  -0.163353 -3.429434 0.381395
H  -5.318964 2.435391 0.795892
H  -4.159534 1.611915 1.830397
H  -3.623611 2.90877 0.746539
elementType: Cl S P O N C H
totalener: -2420.16226905 hartree
nucrepener: 2514.29528967 hartree
electener: -4934.45755872 hartree
oneelecener: -8334.50413069 hartree
twoeener: 3400.04657197 hartree
cpcmener: -0.02838561 hartree
kineticenergy: 2413.96771347 hartree
xcener: -154.009694802372 hartree
chargesum: -0.0000000
charge: -0.094490 -0.152383 -0.429486 0.606546 -0.252840 -0.317138 -0.319640 -0.425836 -0.081076 0.031321 -0.064791 0.219632 0.396782 -0.171570 -0.201850 -0.137663 0.116296 0.019291 0.027330 -0.230853 -0.249853 0.171463 0.148571 0.152812 0.143069 0.141159 0.101365 0.107202 0.109390 0.096432 0.097901 0.081064 0.083725 0.105610 0.080640 0.091866
qa: -0.0945 -0.1524 -0.4295 0.6065 -0.2528 -0.3171 -0.3196 -0.4258 -0.0811 0.0313 -0.0648 0.2196 0.3968 -0.1716 -0.2018 -0.1377 0.1163 0.0193 0.0273 -0.2309 -0.2499 0.1715 0.1486 0.1528 0.1431 0.1412 0.1014 0.1072 0.1094 0.0964 0.0979 0.0811 0.0837 0.1056 0.0806 0.0919
va: 1.2023 2.2450 2.0360 5.4456 2.1923 2.0952 2.0986 2.0904 3.1956 3.8218 3.9099 3.8166 4.3581 4.0085 4.0755 4.0044 3.7931 3.8376 3.8574 3.9481 3.8947 0.9851 1.0115 1.0025 1.0126 1.0065 1.0119 0.9966 0.9909 1.0121 1.0099 0.9962 1.0127 1.0131 1.0148 1.0022
dispcorr: -0.023578724 hartree
energy: -2420.185847771660
dipole: -18.98441 19.55239 0.56797 2.33446 -1.56163 0.77283 1.11471 -0.68276 0.43195
magnitude: 1.05188 au
magnitude: 2.67366 debye
