program: Orca
programVersion: 5.0.2
elementType: Cl S S P O O O O N C C C C C C C C C C C C H H H H H H H H H H H H H H H
charge: 0
multiplicity: 1
keywords: wb97x-d3
keywords: def2-TZVPP
keywords: def2/J RIJCOSX
keywords: DEFGRID2
keywords: scfconv7
keywords: smallprint printgap noloewdin
keywords: NOSOSCF
formula: C12H15ClNO4PS2
InChI: InChI=1/C12H15ClNO4PS2/c1-3-16-19(20,17-4-2)21-8-14-10-6-5-9(13)7-11(10)18-12(14)15/h5-7H,3-4,8H2,1-2H3
36 atoms
Cl 5.212816 -1.812234 -0.634196
S  -1.211587 0.267147 1.952143
S  -3.372043 -1.85891 0.703057
P  -2.199829 -0.409231 0.236038
O  1.357744 1.405762 -1.725231
O  -1.047368 -0.683419 -0.837904
O  -2.83389 0.877843 -0.460341
O  -0.442254 2.716487 -1.399464
N  0.586279 1.564299 0.333997
C  1.678986 0.716111 0.379052
C  -0.34619 1.786865 1.390921
C  2.138451 0.629472 -0.924226
C  0.38894 1.974165 -0.959347
C  2.307862 0.036729 1.399549
C  3.216861 -0.133062 -1.293712
C  3.410372 -0.743143 1.059266
C  3.843351 -0.822307 -0.257375
C  -0.633413 -2.009112 -1.22924
C  -4.169666 1.347689 -0.191588
C  0.204155 -2.701354 -0.183973
C  -4.319153 1.993952 1.163582
H  0.166478 2.150705 2.282073
H  -1.064871 2.543421 1.086033
H  1.972949 0.089343 2.425904
H  3.555907 -0.191441 -2.318849
H  3.927847 -1.294012 1.83232
H  -1.515851 -2.600886 -1.478952
H  -0.064223 -1.856841 -2.144917
H  -4.366561 2.066489 -0.985234
H  -4.869879 0.51822 -0.309009
H  -0.358595 -2.89819 0.728839
H  0.531382 -3.663016 -0.581621
H  1.094327 -2.127606 0.071189
H  -5.318873 2.424635 1.232374
H  -4.214757 1.278305 1.978713
H  -3.600708 2.80119 1.309212
elementType: Cl S P O N C H
totalener: -2420.16218572 hartree
nucrepener: 2510.68128400 hartree
electener: -4930.84346972 hartree
oneelecener: -8327.16346515 hartree
twoeener: 3396.31999543 hartree
cpcmener: -0.02947343 hartree
kineticenergy: 2413.96803838 hartree
xcener: -154.013764901779 hartree
chargesum: 0.0000000
charge: -0.090984 -0.155066 -0.426514 0.610986 -0.250862 -0.329641 -0.326342 -0.424108 -0.068294 0.020656 -0.060826 0.215004 0.397784 -0.192312 -0.188494 -0.123652 0.110510 0.027760 0.028570 -0.231019 -0.253319 0.170702 0.146497 0.148811 0.146094 0.139779 0.107720 0.108012 0.110709 0.095724 0.084742 0.107781 0.062514 0.106092 0.082889 0.092098
qa: -0.0910 -0.1551 -0.4265 0.6110 -0.2509 -0.3296 -0.3263 -0.4241 -0.0683 0.0207 -0.0608 0.2150 0.3978 -0.1923 -0.1885 -0.1237 0.1105 0.0278 0.0286 -0.2310 -0.2533 0.1707 0.1465 0.1488 0.1461 0.1398 0.1077 0.1080 0.1107 0.0957 0.0847 0.1078 0.0625 0.1061 0.0829 0.0921
va: 1.2081 2.2398 2.0341 5.4483 2.1975 2.0994 2.1194 2.0930 3.1878 3.8043 3.9046 3.8421 4.3555 3.9754 4.0792 3.9722 3.8199 3.8241 3.8579 3.8982 3.8936 0.9855 1.0151 1.0064 1.0111 1.0074 1.0125 0.9938 0.9910 1.0115 1.0246 1.0127 1.0028 1.0124 1.0136 1.0015
dispcorr: -0.023792302 hartree
energy: -2420.185978019636
dipole: -18.48031 19.24625 0.76594 2.61648 -2.19033 0.42615 4.88341 -3.63948 1.24393
magnitude: 1.52172 au
magnitude: 3.86790 debye
