program: Orca
programVersion: 5.0.2
elementType: Cl S S P O O O O N C C C C C C C C C C C C H H H H H H H H H H H H H H H
charge: 0
multiplicity: 1
keywords: wb97x-d3
keywords: def2-TZVPP
keywords: def2/J RIJCOSX
keywords: DEFGRID2
keywords: scfconv7
keywords: smallprint printgap noloewdin
keywords: NOSOSCF
formula: C12H15ClNO4PS2
InChI: InChI=1/C12H15ClNO4PS2/c1-3-16-19(20,17-4-2)21-8-14-10-6-5-9(13)7-11(10)18-12(14)15/h5-7H,3-4,8H2,1-2H3
36 atoms
Cl 5.446194 0.981603 -2.588685
S  -0.56603 -1.8208 0.570127
S  -3.243004 -0.298178 2.050048
P  -2.296151 -0.65918 0.413969
O  1.540361 2.282438 0.488067
O  -3.076768 -1.490046 -0.707863
O  -1.749151 0.602843 -0.397458
O  -0.149159 2.046602 1.954811
N  1.101787 0.242866 1.198285
C  2.159083 0.140048 0.310166
C  0.39929 -0.852198 1.785774
C  2.416798 1.432384 -0.11528
C  0.720885 1.554194 1.293973
C  2.910151 -0.920452 -0.14829
C  3.413942 1.749157 -1.001664
C  3.930885 -0.633273 -1.051244
C  4.167977 0.671553 -1.461679
C  -4.177703 -2.37624 -0.423437
C  -2.48267 1.846367 -0.469459
C  -3.716163 -3.701883 0.126823
C  -3.731349 1.737307 -1.307871
H  1.105892 -1.555675 2.225397
H  -0.252107 -0.493384 2.581589
H  2.733374 -1.93889 0.169106
H  3.599625 2.765437 -1.320207
H  4.540973 -1.440377 -1.432293
H  -4.873248 -1.885232 0.259474
H  -4.680974 -2.504657 -1.38062
H  -2.716124 2.187481 0.539954
H  -1.777981 2.549707 -0.908591
H  -4.577675 -4.363975 0.222296
H  -2.998306 -4.184822 -0.536556
H  -3.268292 -3.601868 1.116041
H  -3.519196 1.338589 -2.299577
H  -4.495057 1.118627 -0.835846
H  -4.153706 2.735024 -1.434271
elementType: Cl S P O N C H
totalener: -2420.16492292 hartree
nucrepener: 2420.56948249 hartree
electener: -4840.73440541 hartree
oneelecener: -8147.55865284 hartree
twoeener: 3306.82424743 hartree
cpcmener: -0.02840962 hartree
kineticenergy: 2413.96591147 hartree
xcener: -154.007470531947 hartree
chargesum: 0.0000000
charge: -0.091851 -0.152496 -0.436906 0.641390 -0.253716 -0.356319 -0.346716 -0.425728 -0.061658 0.044189 -0.071334 0.198094 0.401507 -0.173991 -0.192095 -0.139400 0.108698 0.047107 0.027896 -0.250484 -0.239423 0.173476 0.147217 0.156696 0.146704 0.142442 0.094250 0.109693 0.097573 0.111562 0.102023 0.093049 0.078451 0.091893 0.078640 0.099566
qa: -0.0919 -0.1525 -0.4369 0.6414 -0.2537 -0.3563 -0.3467 -0.4257 -0.0617 0.0442 -0.0713 0.1981 0.4015 -0.1740 -0.1921 -0.1394 0.1087 0.0471 0.0279 -0.2505 -0.2394 0.1735 0.1472 0.1567 0.1467 0.1424 0.0942 0.1097 0.0976 0.1116 0.1020 0.0930 0.0785 0.0919 0.0786 0.0996
va: 1.2082 2.2673 2.0061 5.4291 2.2068 2.0979 2.0911 2.0966 3.2034 3.8461 3.8899 3.9019 4.3488 3.9884 4.0924 4.0099 3.8340 3.8354 3.8323 3.9068 3.9291 0.9844 1.0323 1.0006 1.0103 1.0061 1.0133 0.9909 1.0135 0.9890 1.0112 1.0029 1.0175 1.0063 1.0150 1.0077
dispcorr: -0.020249515 hartree
energy: -2420.185172437579
dipole: -29.18452 29.44713 0.26262 -9.42315 7.77665 -1.64649 -0.13268 -0.72728 -0.85996
magnitude: 1.87602 au
magnitude: 4.76846 debye
