program: Orca
programVersion: 5.0.2
elementType: Cl S S P O O O O N C C C C C C C C C C C C H H H H H H H H H H H H H H H
charge: 0
multiplicity: 1
keywords: wb97x-d3
keywords: def2-TZVPP
keywords: def2/J RIJCOSX
keywords: DEFGRID2
keywords: scfconv7
keywords: smallprint printgap noloewdin
keywords: NOSOSCF
formula: C12H15ClNO4PS2
InChI: InChI=1/C12H15ClNO4PS2/c1-3-16-19(20,17-4-2)21-8-14-10-6-5-9(13)7-11(10)18-12(14)15/h5-7H,3-4,8H2,1-2H3
36 atoms
Cl 4.99383 -2.115108 -1.001793
S  -0.686477 1.170012 2.12766
S  -3.127976 -1.02269 2.304117
P  -2.120096 0.069322 1.087442
O  0.909984 0.746664 -2.232819
O  -1.342996 -0.699587 -0.087431
O  -2.890339 1.194374 0.26913
O  -0.831859 2.146017 -1.972596
N  0.629994 1.642919 -0.23913
C  1.733665 0.811323 -0.153734
C  -0.005315 2.305123 0.852053
C  1.88482 0.261897 -1.41551
C  0.117359 1.580557 -1.508679
C  2.590724 0.477185 0.872268
C  2.867901 -0.639588 -1.732629
C  3.60184 -0.436077 0.583542
C  3.727371 -0.976695 -0.68944
C  -0.572836 -1.891578 0.166822
C  -4.17942 0.975367 -0.346958
C  -0.435729 -2.656665 -1.123377
C  -4.108597 0.098068 -1.572548
H  0.715551 2.915979 1.396668
H  -0.7836 2.963934 0.476254
H  2.497371 0.890527 1.866847
H  2.963884 -1.061162 -2.723679
H  4.29158 -0.725031 1.364356
H  0.403393 -1.60361 0.563452
H  -1.075468 -2.500898 0.921631
H  -4.864738 0.562085 0.396316
H  -4.526687 1.974134 -0.604481
H  0.03206 -2.059062 -1.905772
H  0.192948 -3.530904 -0.951226
H  -1.403899 -3.005149 -1.484261
H  -3.874036 -0.938426 -1.329851
H  -5.0840 0.106251 -2.060694
H  -3.373842 0.467128 -2.288455
elementType: Cl S P O N C H
totalener: -2420.16564826 hartree
nucrepener: 2504.62445275 hartree
electener: -4924.79010101 hartree
oneelecener: -8314.80469619 hartree
twoeener: 3390.01459517 hartree
cpcmener: -0.02855846 hartree
kineticenergy: 2413.96182335 hartree
xcener: -154.008347200965 hartree
chargesum: -0.0000000
charge: -0.089968 -0.154632 -0.430366 0.610747 -0.251561 -0.317278 -0.325317 -0.428395 -0.060135 0.021936 -0.076599 0.201144 0.400399 -0.178289 -0.204140 -0.134423 0.124628 0.021177 0.013385 -0.261747 -0.230545 0.175678 0.150921 0.151037 0.147037 0.141840 0.106745 0.118276 0.097713 0.109374 0.089175 0.098129 0.098125 0.076723 0.101938 0.087269
qa: -0.0900 -0.1546 -0.4304 0.6107 -0.2516 -0.3173 -0.3253 -0.4284 -0.0601 0.0219 -0.0766 0.2011 0.4004 -0.1783 -0.2041 -0.1344 0.1246 0.0212 0.0134 -0.2617 -0.2305 0.1757 0.1509 0.1510 0.1470 0.1418 0.1067 0.1183 0.0977 0.1094 0.0892 0.0981 0.0981 0.0767 0.1019 0.0873
va: 1.2104 2.2604 2.0458 5.4346 2.1914 2.0627 2.1078 2.0856 3.1930 3.7994 3.8995 3.8174 4.3469 3.9844 4.0643 4.0076 3.8161 3.8136 3.8723 3.9482 3.8939 0.9813 1.0208 1.0041 1.0107 1.0064 0.9857 1.0157 1.0087 0.9903 1.0025 1.0060 1.0058 1.0157 1.0099 1.0130
dispcorr: -0.023718692 hartree
energy: -2420.189366951071
dipole: -17.92116 19.23411 1.31294 -2.44717 2.77768 0.33051 -5.56748 5.59165 0.02417
magnitude: 1.35412 au
magnitude: 3.44189 debye
