program: Orca
programVersion: 5.0.2
elementType: Cl S S P O O O O N C C C C C C C C C C C C H H H H H H H H H H H H H H H
charge: 0
multiplicity: 1
keywords: wb97x-d3
keywords: def2-TZVPP
keywords: def2/J RIJCOSX
keywords: DEFGRID2
keywords: scfconv7
keywords: smallprint printgap noloewdin
keywords: NOSOSCF
formula: C12H15ClNO4PS2
InChI: InChI=1/C12H15ClNO4PS2/c1-3-16-19(20,17-4-2)21-8-14-10-6-5-9(13)7-11(10)18-12(14)15/h5-7H,3-4,8H2,1-2H3
36 atoms
Cl 5.075695 -0.356304 -1.878156
S  -2.214661 0.722458 1.294753
S  -3.905752 -0.862425 -1.019516
P  -2.200762 -0.798243 -0.136944
O  1.769575 2.730226 0.558694
O  -1.677281 -2.123658 0.58365
O  -0.895885 -0.54871 -1.020411
O  -0.004055 3.347407 1.806522
N  0.505485 1.129486 1.394082
C  1.510672 0.506681 0.670135
C  -0.580008 0.529659 2.104012
C  2.287048 1.534565 0.159638
C  0.667015 2.484488 1.3136
C  1.825858 -0.809728 0.410086
C  3.393888 1.327907 -0.624814
C  2.941633 -1.054121 -0.384412
C  3.699343 -0.004291 -0.887939
C  -2.567483 -3.098866 1.162426
C  -0.824544 0.550874 -1.949474
C  -3.214615 -2.625835 2.44058
C  -1.002331 0.054787 -3.362261
H  -0.364088 -0.521276 2.278743
H  -0.693145 1.006924 3.0772
H  1.236601 -1.631668 0.791298
H  3.983516 2.146947 -1.013139
H  3.213406 -2.075232 -0.613553
H  -3.319051 -3.382965 0.423363
H  -1.935206 -3.966243 1.346507
H  -1.564911 1.316607 -1.70389
H  0.161721 0.99487 -1.811794
H  -3.916318 -1.808917 2.271792
H  -3.775524 -3.455757 2.872967
H  -2.475005 -2.306075 3.175666
H  -1.994063 -0.370367 -3.515898
H  -0.882014 0.889081 -4.054385
H  -0.255553 -0.698526 -3.615095
elementType: Cl S P O N C H
totalener: -2420.16448523 hartree
nucrepener: 2463.03882816 hartree
electener: -4883.20331339 hartree
oneelecener: -8230.75697718 hartree
twoeener: 3347.55366379 hartree
cpcmener: -0.03032859 hartree
kineticenergy: 2413.96304800 hartree
xcener: -154.009396825696 hartree
chargesum: 0.0000000
charge: -0.092491 -0.139786 -0.424518 0.596919 -0.253715 -0.334428 -0.327103 -0.432175 -0.036491 -0.010640 -0.070321 0.218038 0.419809 -0.191526 -0.184827 -0.132136 0.106050 0.035576 0.042300 -0.251680 -0.235573 0.148515 0.170428 0.149885 0.146203 0.140889 0.097295 0.108877 0.092032 0.103110 0.082218 0.104972 0.091473 0.078878 0.094775 0.089167
qa: -0.0925 -0.1398 -0.4245 0.5969 -0.2537 -0.3344 -0.3271 -0.4322 -0.0365 -0.0106 -0.0703 0.2180 0.4198 -0.1915 -0.1848 -0.1321 0.1060 0.0356 0.0423 -0.2517 -0.2356 0.1485 0.1704 0.1499 0.1462 0.1409 0.0973 0.1089 0.0920 0.1031 0.0822 0.1050 0.0915 0.0789 0.0948 0.0892
va: 1.2076 2.2660 2.0396 5.4734 2.2088 2.1010 2.0863 2.0891 3.1875 3.7991 3.8953 3.8196 4.3381 3.9521 4.0863 4.0093 3.8345 3.8396 3.8290 3.8997 3.9638 1.0098 0.9958 1.0120 1.0110 1.0064 1.0134 0.9917 1.0091 0.9913 1.0140 1.0115 1.0028 1.0188 1.0064 1.0044
dispcorr: -0.022162737 hartree
energy: -2420.186647967923
dipole: -16.31167 17.35285 1.04118 -11.98631 9.87692 -2.10939 2.55733 -1.68638 0.87095
magnitude: 2.50841 au
magnitude: 6.37588 debye
