program: Orca
programVersion: 5.0.2
elementType: Cl S S P O O O O N C C C C C C C C C C C C H H H H H H H H H H H H H H H
charge: 0
multiplicity: 1
keywords: wb97x-d3
keywords: def2-TZVPP
keywords: def2/J RIJCOSX
keywords: DEFGRID2
keywords: scfconv7
keywords: smallprint printgap noloewdin
keywords: NOSOSCF
formula: C12H15ClNO4PS2
InChI: InChI=1/C12H15ClNO4PS2/c1-3-16-19(20,17-4-2)21-8-14-10-6-5-9(13)7-11(10)18-12(14)15/h5-7H,3-4,8H2,1-2H3
36 atoms
Cl 5.074267 -0.069545 -1.87369
S  -2.28281 0.444387 1.344038
S  -3.962303 -0.995425 -1.041051
P  -2.208691 -0.886931 -0.26512
O  1.543687 2.723608 0.607062
O  -1.516965 -2.231169 0.246159
O  -1.007822 -0.417529 -1.206114
O  -0.264152 3.182957 1.874842
N  0.409455 1.017137 1.419174
C  1.450255 0.486212 0.673959
C  -0.62415 0.314358 2.111124
C  2.148065 1.578213 0.18387
C  0.468292 2.381939 1.365672
C  1.85941 -0.798662 0.390575
C  3.268365 1.466747 -0.600739
C  2.992386 -0.946681 -0.403686
C  3.672036 0.164724 -0.885195
C  -2.268119 -3.369696 0.713118
C  -1.052157 0.835371 -1.912512
C  -2.841362 -3.167512 2.093559
C  0.079647 0.85475 -2.90684
H  -0.338879 -0.728057 2.226395
H  -0.752837 0.731079 3.110164
H  1.332165 -1.6676 0.758775
H  3.797931 2.332994 -0.972929
H  3.34116 -1.940986 -0.646194
H  -3.052186 -3.605633 -0.00875
H  -1.550271 -4.188501 0.706974
H  -2.014588 0.935892 -2.42077
H  -0.964571 1.658797 -1.199372
H  -3.274146 -4.109292 2.433171
H  -2.073132 -2.877608 2.811235
H  -3.633111 -2.418468 2.10605
H  -0.030394 0.067454 -3.652896
H  0.078046 1.812365 -3.428053
H  1.049447 0.74108 -2.421239
elementType: Cl S P O N C H
totalener: -2420.16626097 hartree
nucrepener: 2473.82295853 hartree
electener: -4893.98921950 hartree
oneelecener: -8252.27382155 hartree
twoeener: 3358.28460205 hartree
cpcmener: -0.03173967 hartree
kineticenergy: 2413.95488948 hartree
xcener: -154.007474064454 hartree
chargesum: -0.0000000
charge: -0.093051 -0.141016 -0.426494 0.595153 -0.253778 -0.334536 -0.319080 -0.430002 -0.045525 0.012523 -0.067535 0.210255 0.413905 -0.194161 -0.187861 -0.128505 0.113636 0.036547 -0.000465 -0.253927 -0.235330 0.145640 0.171204 0.147793 0.143489 0.140932 0.098233 0.108756 0.123313 0.110812 0.105327 0.091266 0.083652 0.096402 0.095570 0.066859
qa: -0.0931 -0.1410 -0.4265 0.5952 -0.2538 -0.3345 -0.3191 -0.4300 -0.0455 0.0125 -0.0675 0.2103 0.4139 -0.1942 -0.1879 -0.1285 0.1136 0.0365 -0.0005 -0.2539 -0.2353 0.1456 0.1712 0.1478 0.1435 0.1409 0.0982 0.1088 0.1233 0.1108 0.1053 0.0913 0.0837 0.0964 0.0956 0.0669
va: 1.2057 2.2653 2.0452 5.4749 2.2056 2.1025 2.1020 2.0905 3.1876 3.7847 3.9049 3.8191 4.3338 3.9728 4.0631 4.0031 3.8125 3.8366 3.8132 3.9029 3.9508 1.0085 0.9941 1.0124 1.0127 1.0064 1.0140 0.9917 1.0103 0.9936 1.0117 1.0021 1.0126 1.0077 1.0080 1.0063
dispcorr: -0.023025600 hartree
energy: -2420.189286570417
dipole: -12.22152 13.58519 1.36367 -11.57793 9.51665 -2.06128 2.58043 -1.74864 0.83179
magnitude: 2.60775 au
magnitude: 6.62838 debye
