program: Orca
programVersion: 5.0.2
elementType: Cl S S P O O O O N C C C C C C C C C C C C H H H H H H H H H H H H H H H
charge: 0
multiplicity: 1
keywords: wb97x-d3
keywords: def2-TZVPP
keywords: def2/J RIJCOSX
keywords: DEFGRID2
keywords: scfconv7
keywords: smallprint printgap noloewdin
keywords: NOSOSCF
formula: C12H15ClNO4PS2
InChI: InChI=1/C12H15ClNO4PS2/c1-3-16-19(20,17-4-2)21-8-14-10-6-5-9(13)7-11(10)18-12(14)15/h5-7H,3-4,8H2,1-2H3
36 atoms
Cl 4.96914 -2.10783 0.352737
S  -2.038667 1.173512 -0.61756
S  -1.740863 0.31666 2.673279
P  -2.12553 -0.29088 0.887267
O  2.114614 1.210969 -2.337452
O  -1.161676 -1.47925 0.456795
O  -3.580366 -0.878126 0.597669
O  0.402058 2.592086 -2.829916
N  0.664847 1.647634 -0.733767
C  1.584579 0.750409 -0.209124
C  -0.545358 2.122194 -0.141919
C  2.481122 0.499197 -1.235432
C  0.980818 1.89963 -2.040751
C  1.726484 0.136797 1.01677
C  3.539377 -0.365627 -1.118228
C  2.791491 -0.746227 1.169437
C  3.668228 -0.988674 0.12077
C  -1.268298 -2.221606 -0.77972
C  -4.767141 -0.502778 1.327586
C  -0.082602 -1.952786 -1.669812
C  -5.296838 0.851269 0.927305
H  -0.452996 2.134816 0.943712
H  -0.73337 3.143042 -0.469007
H  1.040245 0.312029 1.833839
H  4.221399 -0.553649 -1.935963
H  2.928198 -1.249382 2.116697
H  -1.305257 -3.271338 -0.48834
H  -2.201353 -1.994745 -1.298583
H  -5.487536 -1.285561 1.09622
H  -4.557926 -0.543257 2.39801
H  -0.079075 -0.928426 -2.040142
H  0.859851 -2.154531 -1.160035
H  -0.139957 -2.612808 -2.536406
H  -4.622746 1.659043 1.212094
H  -5.483569 0.911849 -0.144984
H  -6.245074 1.018795 1.439797
elementType: Cl S P O N C H
totalener: -2420.16362984 hartree
nucrepener: 2463.47473701 hartree
electener: -4883.63836685 hartree
oneelecener: -8232.15995445 hartree
twoeener: 3348.52158760 hartree
cpcmener: -0.02589317 hartree
kineticenergy: 2413.95259603 hartree
xcener: -154.008689860594 hartree
chargesum: -0.0000000
charge: -0.092804 -0.151284 -0.431016 0.632624 -0.252931 -0.322937 -0.350821 -0.431574 -0.047183 0.048357 -0.074411 0.202635 0.421305 -0.239141 -0.181706 -0.124537 0.099554 0.010765 0.032600 -0.203444 -0.243786 0.158383 0.164356 0.153725 0.144656 0.141511 0.108894 0.101661 0.108493 0.096636 0.060139 0.079740 0.109295 0.078508 0.091536 0.102203
qa: -0.0928 -0.1513 -0.4310 0.6326 -0.2529 -0.3229 -0.3508 -0.4316 -0.0472 0.0484 -0.0744 0.2026 0.4213 -0.2391 -0.1817 -0.1245 0.0996 0.0108 0.0326 -0.2034 -0.2438 0.1584 0.1644 0.1537 0.1447 0.1415 0.1089 0.1017 0.1085 0.0966 0.0601 0.0797 0.1093 0.0785 0.0915 0.1022
va: 1.2053 2.2619 2.0233 5.4308 2.2039 2.1028 2.1118 2.0897 3.1900 3.7444 3.8825 3.8303 4.3252 3.9684 4.0726 4.0197 3.8315 3.8948 3.8646 3.8998 3.8888 1.0181 1.0001 1.0230 1.0116 1.0061 0.9961 0.9984 0.9903 1.0095 1.0140 1.0032 1.0114 1.0165 1.0035 1.0115
dispcorr: -0.022665921 hartree
energy: -2420.186295760340
dipole: -25.51633 24.32452 -1.19181 -1.95676 1.14633 -0.81043 -0.45648 0.85339 0.39691
magnitude: 1.49491 au
magnitude: 3.79975 debye
