program: Orca
programVersion: 5.0.2
elementType: Cl S S P O O O O N C C C C C C C C C C C C H H H H H H H H H H H H H H H
charge: 0
multiplicity: 1
keywords: wb97x-d3
keywords: def2-TZVPP
keywords: def2/J RIJCOSX
keywords: DEFGRID2
keywords: scfconv7
keywords: smallprint printgap noloewdin
keywords: NOSOSCF
formula: C12H15ClNO4PS2
InChI: InChI=1/C12H15ClNO4PS2/c1-3-16-19(20,17-4-2)21-8-14-10-6-5-9(13)7-11(10)18-12(14)15/h5-7H,3-4,8H2,1-2H3
36 atoms
Cl 4.6098 -1.401409 -1.598197
S  -2.278208 1.172322 1.65559
S  -3.947139 -0.672487 -0.510554
P  -2.184945 -0.173895 0.071304
O  1.389435 2.446632 -0.489699
O  -1.208623 -1.352485 0.534804
O  -1.254767 0.594467 -0.97222
O  -0.21916 3.597707 0.59182
N  0.439722 1.479595 1.249414
C  1.379312 0.58654 0.757403
C  -0.540769 1.234587 2.258137
C  1.959215 1.22062 -0.328493
C  0.448281 2.609648 0.478248
C  1.79535 -0.667962 1.146512
C  2.956465 0.65851 -1.085443
C  2.802368 -1.268758 0.397646
C  3.36109 -0.614157 -0.692272
C  -1.638581 -2.430891 1.387335
C  -1.17617 0.237783 -2.369212
C  -0.874365 -3.673049 1.009565
C  -0.383012 -1.021818 -2.612244
H  -0.29561 0.31041 2.773809
H  -0.545553 2.03754 2.995291
H  1.370081 -1.179045 1.998885
H  3.395267 1.171039 -1.930298
H  3.149979 -2.254734 0.67382
H  -1.448189 -2.146678 2.423699
H  -2.713017 -2.591057 1.273367
H  -2.186022 0.152676 -2.775675
H  -0.697832 1.094759 -2.839801
H  0.202539 -3.532095 1.106193
H  -1.164588 -4.48789 1.672728
H  -1.095036 -3.980077 -0.012602
H  -0.246436 -1.143693 -3.687565
H  0.605857 -0.970815 -2.155082
H  -0.894685 -1.911391 -2.246113
elementType: Cl S P O N C H
totalener: -2420.16251348 hartree
nucrepener: 2533.88138509 hartree
electener: -4954.04389857 hartree
oneelecener: -8372.91917683 hartree
twoeener: 3418.87527826 hartree
cpcmener: -0.03389941 hartree
kineticenergy: 2413.97859689 hartree
xcener: -154.011732114396 hartree
chargesum: -0.0000000
charge: -0.094407 -0.143338 -0.429151 0.586911 -0.254378 -0.301665 -0.317539 -0.420727 -0.071917 0.033491 -0.051714 0.206147 0.408890 -0.226085 -0.190170 -0.113673 0.111432 0.017810 0.021122 -0.242046 -0.233937 0.142350 0.168732 0.155440 0.142289 0.140184 0.105092 0.103134 0.105527 0.104548 0.084533 0.098869 0.089515 0.105863 0.076011 0.082857
qa: -0.0944 -0.1433 -0.4292 0.5869 -0.2544 -0.3017 -0.3175 -0.4207 -0.0719 0.0335 -0.0517 0.2061 0.4089 -0.2261 -0.1902 -0.1137 0.1114 0.0178 0.0211 -0.2420 -0.2339 0.1424 0.1687 0.1554 0.1423 0.1402 0.1051 0.1031 0.1055 0.1045 0.0845 0.0989 0.0895 0.1059 0.0760 0.0829
va: 1.2035 2.2708 2.0484 5.4596 2.1948 2.0760 2.0933 2.1032 3.1914 3.8205 3.9238 3.8111 4.3511 3.9841 4.0658 3.9770 3.8047 3.8330 3.8471 3.9478 3.9031 1.0062 0.9906 0.9963 1.0129 1.0068 0.9912 1.0158 1.0115 0.9930 1.0026 1.0091 1.0046 1.0121 1.0004 1.0162
dispcorr: -0.024540751 hartree
energy: -2420.187054229571
dipole: -6.48400 8.24736 1.76336 -16.41414 14.02235 -2.39178 1.43585 -0.08169 1.35415
magnitude: 3.26555 au
magnitude: 8.30036 debye
