program: Gaussian 09
title: 000058840
version: EM64L-G09RevD.01
frameworkgroup: C1[X(C12H20Cl2N2O6)]
method: RPBEPBE
basis: SDD
operation: Freq
keyword: #p
keyword: freq=noraman
keyword: PBEPBE/SDD
title: #p freq=noraman PBEPBE/SDD
converged: YES YES NO NO
title: Mulliken charges:
elementType: Cl Cl O O O O O O N N C C C C C C C C C C C C H H H H H H H H H H H H H H H H H H H H
charge: -0.070115 -0.073487 -0.272355 -0.241948 -0.198152 -0.217111 -0.163111 -0.190920 -0.111153 0.087935 0.089209 -0.487003 -0.283568 -0.308765 0.237353 0.261741 -0.603133 -0.608476 -0.221764 -0.223927 -0.675541 -0.668042 0.268122 0.250370 0.239570 0.219547 0.249895 0.233375 0.317302 0.256417 0.276230 0.289356 0.242821 0.237111 0.236672 0.239541 0.235994 0.236466 0.219889 0.240388 0.237073 0.216197
chargesum: 0.00000
title: Mulliken charges with hydrogens summed into heavy atoms:
elementType: Cl Cl O O O O O O N N C C C C C C C C C C C C
charge: -0.070115 -0.073487 -0.272355 -0.241948 -0.198152 -0.217111 -0.163111 -0.190920 -0.111153 0.087935 0.089209 0.031489 0.175549 0.174505 0.237353 0.261741 -0.029414 -0.042891 0.258168 0.252285 0.016809 0.025615
polarizability: 2.09489625e+02 -2.54893492e-01 2.20081582e+02 -2.27429737e+00 1.43226145e+00 1.51090022e+02
1716.lowfreq: -9.0693 -8.4313 -3.3229 -0.0021 -0.0019 -0.0013 4.3034 26.5959 36.6129
frequency: -6.4976 26.5066 36.5795 40.3183 46.5384 54.5264 59.5824 63.6047 74.8029 79.3977 84.7526 92.6916 106.3992 112.9925 122.3982 138.6219 146.6266 176.7980 179.7894 200.6459 208.8894 216.9488 233.0563 255.8202 266.9424 283.8246 297.5186 319.8562 333.6519 360.8086 366.0558 388.3476 416.8823 474.4691 478.9744 509.9435 588.7112 617.7299 660.3281 661.2132 678.4640 733.6040 748.4952 762.9501 777.8369 791.7934 799.1914 799.7256 801.9762 826.5081 836.5887 882.5344 914.6856 1001.2168 1008.1173 1011.1364 1013.2240 1032.8615 1051.3463 1059.1916 1065.7317 1113.1681 1116.0455 1116.5614 1124.6913 1134.9454 1136.3403 1153.4162 1167.1765 1204.6604 1221.4226 1245.2464 1250.0519 1252.0448 1253.4278 1265.7992 1291.7177 1328.2470 1349.8191 1353.0068 1356.7893 1363.7648 1377.4119 1396.0184 1403.1554 1404.0871 1408.5190 1440.6563 1445.4468 1452.6580 1459.1018 1462.8453 1465.2961 1466.3525 1471.5220 1472.2414 1484.3391 1484.6904 1632.7581 1639.0411 2950.2010 2960.3756 3000.6193 3001.2070 3004.1954 3018.2760 3019.4995 3060.7736 3065.3180 3075.2423 3078.7809 3080.8263 3082.1020 3084.7427 3096.7659 3097.8429 3116.1373 3116.4863 3151.3295 3173.5731
redmass: 8.1887 5.1649 7.2430 5.9248 5.9908 8.6761 4.2892 3.0136 3.2433 5.0103 3.0784 4.6163 3.9923 2.6316 2.5910 5.2648 3.3925 4.4545 4.0908 2.8453 3.1267 4.4880 3.3507 1.6867 1.9493 3.6304 5.9623 4.0238 6.5098 4.2266 4.9956 4.1890 7.6513 2.9623 2.3534 6.5864 9.9067 8.7355 5.9443 5.8195 5.7018 10.7724 8.2946 1.1461 1.2897 4.7092 1.2959 1.1863 2.3218 5.8451 4.4423 4.2903 3.8143 1.5020 2.0658 1.8354 2.0244 4.0074 4.9394 5.5453 4.2829 1.9350 2.2269 1.9681 1.7006 1.4585 1.4536 3.9773 2.6319 5.6077 2.8785 1.5248 1.2455 1.1383 1.1563 1.3685 1.1305 1.3374 1.3764 1.3465 1.3706 1.2541 1.2563 1.2451 1.3787 1.2809 5.5178 1.1011 1.0870 1.0832 1.0913 1.0389 1.0902 1.0455 1.0723 1.0742 1.0662 1.0622 11.7030 11.0960 1.0682 1.0663 1.0360 1.0362 1.0614 1.0581 1.0579 1.0624 1.0861 1.0764 1.0795 1.1071 1.1068 1.1022 1.0980 1.0984 1.1035 1.1032 1.1121 1.1099
irintensity: 0.1181 0.3944 1.3373 0.8256 0.3829 1.3982 2.0675 0.7954 0.8274 1.1874 3.9829 1.8699 1.9940 2.6885 1.0724 0.2790 0.8502 2.9292 0.5659 3.2827 6.3931 1.2929 8.9610 2.6751 3.9214 3.9892 3.2438 4.9819 13.5425 9.5976 11.2033 2.3187 1.4343 1.5842 2.4516 10.2274 7.4902 35.8492 59.2016 65.4515 29.4443 27.0687 16.7228 5.7624 16.3861 6.1385 8.9301 11.0149 16.9111 18.7562 0.6452 34.0269 20.6473 3.3359 19.4433 67.4283 20.3217 192.0585 6.3606 35.1407 116.4080 36.5793 0.3809 26.7785 83.0396 6.6969 6.0781 81.9317 201.7810 255.7070 200.2404 16.8317 3.9766 0.8742 0.7482 5.9199 17.8836 5.6550 14.3879 5.9305 7.3686 5.1914 0.9143 3.8473 51.5052 42.4229 126.2121 12.5091 11.7582 4.6967 11.5147 13.6419 19.7082 12.8888 3.0573 17.6147 19.5193 15.7375 155.7130 210.6000 60.8416 42.4905 14.2607 14.8230 13.3183 12.1054 12.6489 9.3874 5.5986 14.3622 21.3280 4.3858 4.0194 9.2871 21.6036 21.5957 27.5447 30.5397 12.6368 6.5354
temp: 298.150 k
press: 1.00000 atm
elementType: 17 17 8 8 8 8 8 8 7 7 6 6 6 6 6 6 6 6 6 6 6 6 1 1 1 1 1 1 1 1 1 1 1 1 1 1 1 1 1 1 1 1
symmnumber: 1
zpe: 848029.7 jmol-1
zpe.correction: 0.322997 hartree
zpe.thermalcorrener: 0.348497 hartree
zpe.thermalcorrenthalpy: 0.349441 hartree
zpe.thermalcorrgfe: 0.264694 hartree
zpe.sumelectzpe: -1948.395256 hartree
zpe.sumelectthermal: -1948.369756 hartree
zpe.sumelectthermalent: -1948.368812 hartree
zpe.sumelectthermalfe: -1948.453560 hartree
dipole: -0.6834 -1.6283 -0.9493
dipole: 2.0049
quadrupole: -140.6521 -157.4433 -147.1169
quadrupole: -11.1014 12.7669 4.3514
quadrupole: 7.7520 -9.0392 1.2872 -11.1014 12.7669 4.3514
hfenergy: -1948.7182532 hartree
pointgroup: C01 [X(C12H20Cl2N2O6)]
dipole: 0.3757963 0.6309892 0.2877733 debye
polarizability: 216.8483918|4.9486188|211.5736958|0.1562305|-8.7218565|152.2391408 unknown
InChI: InChI=1S/C12H20Cl2N2O6/c1-3-21-10(17)12(16(19)20,11(18)22-4-2)9-15(7-5-13)8-6-14/h3-9H2,1-2H3
charge 0 multiplicity 1
42 atoms
Cl -3.314695 -4.354755 0.623776
Cl 3.365895 -3.334715 0.821044
O  1.924763 0.43897 -0.306712
O  -1.961806 2.046338 0.134674
O  0.425458 0.703219 1.46113
O  -2.691574 -0.135155 -0.214298
O  0.640798 2.647682 -1.562271
O  -0.817664 1.610991 -2.978335
N  -0.199581 -2.032583 -0.879921
N  -0.158621 1.700403 -1.874396
C  -0.395433 0.529674 -0.8712
C  -0.314146 -0.825098 -1.692794
C  -1.354113 -2.953612 -0.796618
C  1.139842 -2.64257 -0.74734
C  0.668396 0.587718 0.242305
C  -1.811897 0.748822 -0.279396
C  -1.929021 -3.060157 0.628021
C  1.523721 -2.881392 0.725037
C  3.095762 0.62888 0.620421
C  -3.277465 2.410523 0.767508
C  4.354715 0.448741 -0.216642
C  -3.206966 3.896442 1.092201
H  -1.220171 -0.859987 -2.320519
H  0.560475 -0.724015 -2.361991
H  -2.159409 -2.598762 -1.462307
H  -1.052292 -3.965934 -1.140015
H  1.885642 -1.960058 -1.186753
H  1.194519 -3.606662 -1.297599
H  -2.394533 -2.121092 0.949856
H  -1.200121 -3.423682 1.366131
H  1.004781 -3.735199 1.183863
H  1.39809 -1.975535 1.335004
H  3.005654 1.640749 1.053576
H  3.015997 -0.116122 1.431513
H  -4.077797 2.160929 0.048205
H  -3.396547 1.778838 1.665458
H  4.413132 -0.573696 -0.626358
H  4.385657 1.173939 -1.047001
H  5.242696 0.61109 0.420794
H  -2.378094 4.107872 1.78807
H  -3.058765 4.495236 0.177953
H  -4.152183 4.214721 1.568128
