program: Orca
programVersion: 5.0.2
elementType: Cl S S P O O O O N C C C C C C C C C C C C H H H H H H H H H H H H H H H
charge: 0
multiplicity: 1
keywords: wb97x-d3
keywords: def2-TZVPP
keywords: def2/J RIJCOSX
keywords: DEFGRID2
keywords: scfconv7
keywords: smallprint printgap noloewdin
keywords: NOSOSCF
formula: C12H15ClNO4PS2
InChI: InChI=1/C12H15ClNO4PS2/c1-3-16-19(20,17-4-2)21-8-14-10-6-5-9(13)7-11(10)18-12(14)15/h5-7H,3-4,8H2,1-2H3
36 atoms
Cl 4.702016 -2.422004 0.33511
S  -1.925012 1.886918 -0.580047
S  -1.790665 0.404674 2.504226
P  -2.117715 0.189255 0.61614
O  2.0386 0.992456 -2.431449
O  -1.177061 -0.84333 -0.153641
O  -3.580091 -0.287346 0.186068
O  0.528084 2.597517 -2.902408
N  0.799372 1.742681 -0.770802
C  1.620864 0.758327 -0.24209
C  -0.251703 2.461641 -0.122133
C  2.393442 0.314962 -1.30363
C  1.051613 1.867635 -2.108004
C  1.786858 0.229266 1.019619
C  3.355158 -0.65625 -1.184715
C  2.751772 -0.761752 1.173818
C  3.51312 -1.186563 0.093157
C  -0.867683 -2.13764 0.411295
C  -4.77604 -0.006835 0.944664
C  -0.017569 -2.883717 -0.582402
C  -5.434935 -1.302713 1.336724
H  -0.123565 2.406387 0.957167
H  -0.218225 3.511306 -0.40911
H  1.191858 0.549987 1.863448
H  3.946335 -0.985702 -2.027844
H  2.904411 -1.200416 2.150071
H  -0.340186 -1.999494 1.356731
H  -1.79587 -2.676958 0.614776
H  -4.533679 0.58664 1.828197
H  -5.421675 0.592917 0.302764
H  0.240371 -3.858629 -0.167488
H  -0.546591 -3.049265 -1.521098
H  0.912355 -2.354513 -0.793419
H  -4.793246 -1.891507 1.99278
H  -6.357307 -1.086167 1.876909
H  -5.692405 -1.904103 0.464899
elementType: Cl S P O N C H
totalener: -2420.16532710 hartree
nucrepener: 2458.72647478 hartree
electener: -4878.89180187 hartree
oneelecener: -8222.77644553 hartree
twoeener: 3343.88464366 hartree
cpcmener: -0.02693694 hartree
kineticenergy: 2413.96840192 hartree
xcener: -154.007404903569 hartree
chargesum: -0.0000000
charge: -0.092734 -0.135732 -0.445507 0.630306 -0.252235 -0.323115 -0.356081 -0.432770 -0.047772 0.036797 -0.071970 0.215423 0.415877 -0.221643 -0.172525 -0.138926 0.104461 -0.001433 0.047880 -0.237259 -0.231968 0.150938 0.168353 0.148480 0.143585 0.141338 0.106780 0.135942 0.085513 0.105800 0.095799 0.097460 0.067632 0.079958 0.092883 0.090465
qa: -0.0927 -0.1357 -0.4455 0.6303 -0.2522 -0.3231 -0.3561 -0.4328 -0.0478 0.0368 -0.0720 0.2154 0.4159 -0.2216 -0.1725 -0.1389 0.1045 -0.0014 0.0479 -0.2373 -0.2320 0.1509 0.1684 0.1485 0.1436 0.1413 0.1068 0.1359 0.0855 0.1058 0.0958 0.0975 0.0676 0.0800 0.0929 0.0905
va: 1.2061 2.2864 1.9963 5.4443 2.2155 2.0836 2.1142 2.0876 3.1970 3.7664 3.9052 3.8587 4.3507 3.9313 4.0461 3.9917 3.8067 3.8234 3.8331 3.9575 3.9356 1.0149 0.9936 1.0208 1.0120 1.0064 0.9992 0.9919 1.0157 0.9944 1.0073 1.0073 1.0068 1.0106 1.0087 1.0042
dispcorr: -0.022035845 hartree
energy: -2420.187362939893
dipole: -23.65595 22.98460 -0.67135 -9.60337 8.66488 -0.93849 6.86312 -5.29238 1.57074
magnitude: 1.94903 au
magnitude: 4.95404 debye
