program: Orca
programVersion: 5.0.2
elementType: Cl S S P O O O O N C C C C C C C C C C C C H H H H H H H H H H H H H H H
charge: 0
multiplicity: 1
keywords: wb97x-d3
keywords: def2-TZVPP
keywords: def2/J RIJCOSX
keywords: DEFGRID2
keywords: scfconv7
keywords: smallprint printgap noloewdin
keywords: NOSOSCF
formula: C12H15ClNO4PS2
InChI: InChI=1/C12H15ClNO4PS2/c1-3-16-19(20,17-4-2)21-8-14-10-6-5-9(13)7-11(10)18-12(14)15/h5-7H,3-4,8H2,1-2H3
36 atoms
Cl 5.391185 1.318387 -2.499566
S  -0.427604 -1.987775 0.621804
S  -3.173448 -0.611444 2.110558
P  -2.237881 -0.957111 0.464582
O  1.367087 2.282633 0.547238
O  -2.972709 -1.884954 -0.609072
O  -1.804172 0.30593 -0.409806
O  -0.317268 1.905311 1.98956
N  1.074189 0.207962 1.229987
C  2.141798 0.193789 0.347199
C  0.464986 -0.938799 1.824994
C  2.307843 1.507537 -0.058883
C  0.594614 1.486274 1.334809
C  2.971773 -0.801605 -0.121733
C  3.286932 1.909862 -0.930386
C  3.975392 -0.426977 -1.011562
C  4.123106 0.898141 -1.397421
C  -3.977776 -2.859424 -0.255947
C  -2.70113 1.422319 -0.610775
C  -5.361247 -2.291209 -0.440013
C  -2.027701 2.39217 -1.545881
H  1.230044 -1.579489 2.262578
H  -0.208701 -0.628834 2.622607
H  2.868051 -1.835053 0.178723
H  3.401014 2.941979 -1.231188
H  4.645121 -1.181576 -1.399816
H  -3.806869 -3.704812 -0.921202
H  -3.828026 -3.206657 0.768053
H  -3.641628 1.062673 -1.034232
H  -2.916582 1.887493 0.352513
H  -5.549446 -1.464212 0.244195
H  -5.517197 -1.943227 -1.461423
H  -6.097651 -3.069635 -0.236754
H  -1.827397 1.941855 -2.518216
H  -2.684786 3.248089 -1.702884
H  -1.090296 2.7648 -1.132441
elementType: Cl S P O N C H
totalener: -2420.16551949 hartree
nucrepener: 2415.45426595 hartree
electener: -4835.61978544 hartree
oneelecener: -8137.31553738 hartree
twoeener: 3301.69575194 hartree
cpcmener: -0.02874062 hartree
kineticenergy: 2413.95791997 hartree
xcener: -154.003324771549 hartree
chargesum: -0.0000000
charge: -0.091759 -0.151577 -0.437743 0.647239 -0.255530 -0.359399 -0.332302 -0.423268 -0.055813 0.048961 -0.079632 0.202655 0.388494 -0.176965 -0.192106 -0.138203 0.107868 0.049987 0.006603 -0.239502 -0.243919 0.171403 0.149592 0.155857 0.146856 0.142138 0.108557 0.088409 0.125460 0.107702 0.076958 0.089391 0.096329 0.089672 0.092569 0.085022
qa: -0.0918 -0.1516 -0.4377 0.6472 -0.2555 -0.3594 -0.3323 -0.4233 -0.0558 0.0490 -0.0796 0.2027 0.3885 -0.1770 -0.1921 -0.1382 0.1079 0.0500 0.0066 -0.2395 -0.2439 0.1714 0.1496 0.1559 0.1469 0.1421 0.1086 0.0884 0.1255 0.1077 0.0770 0.0894 0.0963 0.0897 0.0926 0.0850
va: 1.2084 2.2747 2.0026 5.4303 2.1975 2.0989 2.0937 2.0968 3.1986 3.8505 3.8968 3.8822 4.3608 3.9934 4.0915 4.0075 3.8344 3.8353 3.8295 3.9225 3.9623 0.9846 1.0306 1.0011 1.0102 1.0062 0.9949 1.0128 0.9890 1.0063 1.0200 1.0039 1.0092 1.0038 1.0073 1.0081
dispcorr: -0.020072226 hartree
energy: -2420.185591710685
dipole: -28.85864 29.21066 0.35202 -5.38547 3.81604 -1.56943 -2.48744 1.55364 -0.93380
magnitude: 1.85985 au
magnitude: 4.72735 debye
