program: Orca
programVersion: 5.0.2
elementType: Cl S S P O O O O N C C C C C C C C C C C C H H H H H H H H H H H H H H H
charge: 0
multiplicity: 1
keywords: wb97x-d3
keywords: def2-TZVPP
keywords: def2/J RIJCOSX
keywords: DEFGRID2
keywords: scfconv7
keywords: smallprint printgap noloewdin
keywords: NOSOSCF
formula: C12H15ClNO4PS2
InChI: InChI=1/C12H15ClNO4PS2/c1-3-16-19(20,17-4-2)21-8-14-10-6-5-9(13)7-11(10)18-12(14)15/h5-7H,3-4,8H2,1-2H3
36 atoms
Cl 5.535236 -1.386282 -0.1662
S  -0.886417 1.317715 1.65852
S  -2.778049 -1.320699 2.292581
P  -2.000199 -0.267777 0.885992
O  1.103551 0.099181 -2.30673
O  -0.914776 -0.973674 -0.046848
O  -3.005828 0.348461 -0.193503
O  -0.878756 1.1428 -2.52166
N  0.513925 1.487321 -0.697134
C  1.736713 0.94689 -0.33538
C  -0.35416 2.233447 0.155545
C  2.08217 0.08234 -1.359862
C  0.120011 0.941161 -1.890471
C  2.559359 1.118738 0.756324
C  3.237779 -0.656558 -1.36439
C  3.740963 0.382547 0.783648
C  4.06065 -0.483251 -0.253122
C  -1.081504 -2.318106 -0.551687
C  -4.353202 0.745659 0.125856
C  -2.130678 -2.422132 -1.631002
C  -4.418141 1.978391 0.994315
H  0.158842 3.113527 0.544106
H  -1.21692 2.574017 -0.41129
H  2.316089 1.791183 1.566995
H  3.487252 -1.33039 -2.172847
H  4.411764 0.489173 1.624875
H  -0.099055 -2.585061 -0.936708
H  -1.305967 -2.985068 0.283455
H  -4.820404 0.927286 -0.840604
H  -4.871731 -0.092044 0.596191
H  -1.956837 -1.705865 -2.434244
H  -2.085397 -3.423053 -2.062023
H  -3.139929 -2.27958 -1.244643
H  -4.035813 1.797077 1.999015
H  -3.869581 2.812815 0.556527
H  -5.461383 2.281322 1.092196
elementType: Cl S P O N C H
totalener: -2420.16420383 hartree
nucrepener: 2486.58991977 hartree
electener: -4906.75412360 hartree
oneelecener: -8279.34033679 hartree
twoeener: 3372.58621319 hartree
cpcmener: -0.02887650 hartree
kineticenergy: 2413.96943549 hartree
xcener: -154.010319336132 hartree
chargesum: 0.0000000
charge: -0.091761 -0.150033 -0.428397 0.606314 -0.254033 -0.323892 -0.325264 -0.427902 -0.071594 0.052671 -0.064048 0.192396 0.389593 -0.183632 -0.184364 -0.136589 0.109294 0.014284 0.038492 -0.238681 -0.248069 0.170626 0.147545 0.157455 0.145295 0.141334 0.103934 0.105810 0.109834 0.094540 0.089801 0.101866 0.082649 0.077296 0.092783 0.104446
qa: -0.0918 -0.1500 -0.4284 0.6063 -0.2540 -0.3239 -0.3253 -0.4279 -0.0716 0.0527 -0.0640 0.1924 0.3896 -0.1836 -0.1844 -0.1366 0.1093 0.0143 0.0385 -0.2387 -0.2481 0.1706 0.1475 0.1575 0.1453 0.1413 0.1039 0.1058 0.1098 0.0945 0.0898 0.1019 0.0826 0.0773 0.0928 0.1044
va: 1.2089 2.2505 2.0447 5.4368 2.1938 2.1029 2.0739 2.0866 3.2102 3.8065 3.9064 3.8734 4.3605 4.0050 4.0863 4.0065 3.8318 3.8525 3.8386 3.9009 3.9143 0.9845 1.0201 1.0002 1.0109 1.0065 0.9920 1.0109 0.9909 1.0124 1.0113 1.0103 1.0135 1.0156 1.0017 1.0126
dispcorr: -0.022386915 hartree
energy: -2420.186590749156
dipole: -26.83681 27.00372 0.16691 3.25032 -1.99822 1.25210 -2.50689 2.47209 -0.03480
magnitude: 1.26366 au
magnitude: 3.21197 debye
