program: Gaussian 09
title: 000006208
version: EM64L-G09RevD.01
frameworkgroup: C1[X(C6H6O3)]
method: RPBEPBE
basis: SDD
operation: Freq
keyword: #p
keyword: freq=noraman
keyword: PBEPBE/SDD
title: #p freq=noraman PBEPBE/SDD
converged: NO NO NO NO
title: Mulliken charges:
elementType: O O O C C C C C C H H H H H H
charge: -0.232689 -0.216542 -0.213882 0.300320 0.249674 -0.342933 -0.300757 -0.519324 -0.176688 0.259800 0.282863 0.234249 0.234251 0.257660 0.184000
chargesum: 0.00000
title: Mulliken charges with hydrogens summed into heavy atoms:
elementType: O O O C C C C C C
charge: -0.232689 -0.216542 -0.213882 0.300320 0.249674 -0.083134 -0.017894 0.206835 0.007312
polarizability: 1.33474559e+02 -4.23735702e+00 6.78343004e+01 1.45657043e-02 9.16310341e-03 3.55860057e+01
1716.lowfreq: -14.5740 -12.1877 -5.8988 0.0006 0.0011 0.0011 74.1786 136.8412 143.6784
frequency: 74.1216 136.8109 143.6744 170.6134 239.0032 251.2674 311.7411 368.8423 557.6101 602.2839 626.5008 643.8042 740.3231 770.1508 883.9136 897.8462 923.4180 967.5564 1002.0597 1021.0112 1115.8494 1150.4323 1162.1069 1225.8464 1258.0758 1361.5754 1381.3420 1423.1257 1463.6587 1465.6907 1530.0705 1571.7081 1592.3136 2920.4168 2984.7223 3082.1559 3154.0027 3229.1189 3247.1466
redmass: 4.0191 3.5144 5.3972 1.2287 3.5605 2.5124 5.6174 7.2327 6.1385 4.4051 6.8884 5.2707 5.0116 1.2660 1.3595 5.7933 8.9306 1.7077 4.7860 1.3919 1.2492 1.4045 2.5622 1.7906 9.3120 2.7825 1.7284 1.2666 1.0494 1.0524 5.4498 5.9733 6.7432 1.0850 1.0318 1.1055 1.1014 1.0937 1.1041
irintensity: 1.0441 7.3848 4.3434 1.2317 4.8397 20.5203 0.2426 7.2443 12.2741 2.9594 24.1212 1.6268 46.7099 76.8964 4.8219 29.1563 9.3877 4.3165 55.6641 92.2202 0.0279 17.1118 3.4247 14.9727 14.4992 13.4357 52.9024 93.4588 17.9110 43.3192 756.0349 53.2777 157.7555 88.9541 54.7252 34.9153 11.8055 1.2050 3.0765
temp: 298.150 k
press: 1.00000 atm
elementType: 8 8 8 6 6 6 6 6 6 1 1 1 1 1 1
symmnumber: 1
zpe: 285021.7 jmol-1
zpe.correction: 0.108559 hartree
zpe.thermalcorrener: 0.117063 hartree
zpe.thermalcorrenthalpy: 0.118007 hartree
zpe.thermalcorrgfe: 0.074974 hartree
zpe.sumelectzpe: -457.186920 hartree
zpe.sumelectthermal: -457.178416 hartree
zpe.sumelectthermalent: -457.177472 hartree
zpe.sumelectthermalfe: -457.220505 hartree
dipole: -6.3367 1.9146 -0.0027
dipole: 6.6197
quadrupole: -55.0976 -49.7367 -52.9842
quadrupole: -5.7072 -0.0176 -0.0029
quadrupole: -2.4914 2.8694 -0.3780 -5.7072 -0.0176 -0.0029
hfenergy: -457.2954786 hartree
pointgroup: C01 [X(C6H6O3)]
dipole: 2.4876438 -0.770991 -0.001051 debye
dipolederiv: -0.3628443 -0.0756614 -0.0001128 0.0684706 -0.5541224 0.0001154 -0.0005364 0.0002385 -0.1192451 -1.9497197 -0.1320153 -0.0001281 -0.5689181 -0.3953585 -0.0000608 -0.00024 -0.0000251 -0.269864 -1.3738812 0.120726 -0.000607 -0.3941107 -0.4002042 -0.0003947 0.0028118 0.0001351 -0.3461255 1.4980567 0.2790045 0.0001817 1.2442318 0.6442299 0.0000221 -0.0000481 0.0000307 0.1892438 -0.7708303 0.3677865 0.0002155 1.0350671 -0.0682059 -0.0000291 0.0000016 -0.0001194 -0.0295848 -0.6927737 -0.0149071 0.000008 -0.6611769 -0.2119313 -0.0001455 0.0000064 -0.0000917 -0.2851154 0.652404 -0.0572921 0.0000949 -0.3449405 0.0538829 -0.0000985 -0.0000399 0.0001715 -0.1061197 0.9470129 -0.068992 0.0000664 -0.4313903 0.2349349 -0.0000223 0.0002137 0.0000067 0.3182796 1.8841937 -0.2976641 0.0002422 -0.211393 0.7533974 0.0008277 -0.0026645 0.0007968 0.1231716 0.02404 0.0826748 -0.0000209 0.0758846 0.0670128 0.0000619 0.0000308 0.0000536 0.2178828 0.0812969 -0.0571978 -0.0000011 -0.0489038 0.0682048 0.0000028 -0.0000145 -0.0000169 0.1875184 0.0285524 -0.0075502 -0.0405551 0.151424 0.0111698 -0.1079178 0.0329498 -0.1000247 -0.0677029 0.0285768 -0.0075735 0.0405927 0.1513711 0.0112403 0.1079271 -0.0329651 0.099994 -0.0677676 -0.0579433 -0.0668477 -0.0000137 -0.1104498 0.0283285 -0.0000021 0.0000018 0.0000022 0.1333815 0.063859 -0.0644905 0.0000373 0.0448339 -0.242579 -0.0002862 0.0004927 -0.0011514 0.1220471 unknown
polarizability: 133.410939|-4.7039557|67.8979207|-0.0146305|-0.0090592|35.5860057 unknown
InChI: InChI=1S/C6H6O3/c1-8-6-3-2-5(4-7)9-6/h2-4H,1H3
charge 0 multiplicity 1
15 atoms
O  0.000334 0.937316 -0.000635
O  2.300496 0.813774 -0.000137
O  -3.529088 0.005214 0.002318
C  1.121738 0.126466 -0.000215
C  -1.129892 0.04657 -0.000874
C  0.7736 -1.230054 -0.000054
C  -0.659543 -1.267989 -0.000283
C  3.514209 -0.029653 0.000214
C  -2.444285 0.661003 -0.001489
H  1.452338 -2.078982 0.000233
H  -1.298311 -2.148947 -0.000235
H  3.5452 -0.659917 -0.907081
H  3.544882 -0.659609 0.907733
H  4.351592 0.680151 0.000244
H  -2.43097 1.776657 0.001662
