program: Gaussian 09
title: 000058811
version: EM64L-G09RevD.01
frameworkgroup: C1[X(C17H19NO3)]
method: RPBEPBE
basis: SDD
operation: Freq
keyword: #p
keyword: freq=noraman
keyword: PBEPBE/SDD
title: #p freq=noraman PBEPBE/SDD
converged: YES YES NO NO
title: Mulliken charges:
elementType: O O O N C C C C C C C C C C C C C C C C C H H H H H H H H H H H H H H H H H H H
charge: -0.485433 -0.262246 -0.239456 -0.023046 0.077188 -0.059370 0.348593 -0.737680 -0.718097 0.137576 -0.371991 -0.388628 -0.254034 -0.222728 -0.357323 -0.241942 0.114395 -0.270860 -0.195353 -0.362298 -0.175976 0.221039 0.216057 0.220159 0.241450 0.244372 0.206220 0.232196 0.254558 0.284317 0.372133 0.228102 0.226689 0.256822 0.266325 0.229089 0.268090 0.244700 0.243378 0.233014
chargesum: 0.00000
title: Mulliken charges with hydrogens summed into heavy atoms:
elementType: O O O N C C C C C C C C C C C C C C C C C
charge: -0.113299 -0.262246 -0.239456 -0.023046 0.077188 0.161669 0.348593 -0.060014 -0.035309 0.137576 -0.117433 -0.104311 -0.025932 0.003961 0.165824 -0.012854 0.114395 -0.002770 0.049346 -0.118920 0.057038
polarizability: 2.08224487e+02 -3.23027723e-02 2.15827989e+02 -8.82197776e+00 4.53282396e+00 1.45080573e+02
1716.lowfreq: -13.1584 -9.2889 -0.0010 -0.0007 -0.0006 5.4529 15.0220 22.3630 31.9113
frequency: 14.7472 22.2823 31.8456 53.4468 63.2505 83.2152 95.0822 110.7601 138.4525 171.5446 203.3033 214.2628 238.2101 248.5917 252.5805 273.5210 287.1965 304.9518 351.7640 371.5288 385.2910 401.2992 404.6035 432.2887 451.8275 456.2435 504.0653 523.4856 574.9415 600.2954 615.7898 627.0814 653.5766 690.7325 706.9039 715.1801 745.5472 761.0653 772.4748 801.8620 861.4637 873.1643 891.6200 908.5763 924.3473 932.2947 934.4016 957.9221 959.7789 964.0739 981.9206 985.6456 989.4854 994.2192 1004.5344 1007.6642 1024.2962 1028.8255 1040.6785 1076.8406 1091.2883 1122.6970 1132.5997 1163.4276 1169.2959 1171.1323 1184.2310 1186.4208 1194.4284 1236.0451 1239.8400 1280.3822 1300.9485 1308.7195 1317.2331 1318.1030 1341.0580 1351.5561 1376.1973 1379.4009 1394.0240 1414.4270 1431.7599 1434.6190 1456.2928 1463.1715 1473.3995 1474.9102 1480.3603 1492.4360 1569.6541 1585.8676 1588.6792 1603.2629 1611.9596 2978.3937 2987.5415 3005.7141 3031.8017 3068.4479 3080.9153 3089.2049 3096.6451 3108.2024 3123.6086 3130.7849 3134.2996 3144.6258 3148.5789 3160.5827 3164.5997 3175.1143 3175.6111 3441.5825
redmass: 4.5345 5.1060 4.5904 4.5183 7.1340 3.5725 2.8713 4.9128 4.1685 4.1664 1.0986 3.9943 1.3171 3.2322 3.7496 3.4741 3.2552 4.3371 4.0822 4.9833 2.3218 3.2783 2.8937 1.5902 2.6144 2.9074 3.4159 4.5001 4.9394 6.1867 6.3912 6.5469 4.1827 6.9903 2.0852 2.9070 3.6547 1.3327 1.8175 4.8756 1.2466 2.8085 3.6937 1.2841 1.2675 1.5502 3.2010 1.4558 1.6683 6.3248 2.3751 1.6545 4.1330 2.7988 1.3697 1.3691 2.2630 2.1476 2.3652 1.5497 1.6410 2.7014 2.4088 2.0980 1.0868 1.1198 1.5333 2.1729 2.2466 1.2237 2.6141 1.5266 1.4101 1.3750 5.2051 1.4051 1.4178 1.4709 1.2227 7.6370 1.2074 1.8166 2.1803 1.1679 2.2420 1.0439 1.0501 2.1941 1.0483 1.0557 5.9357 5.5710 6.2470 7.0657 7.5753 1.0363 1.0359 1.0828 1.0582 1.0985 1.0993 1.0999 1.0997 1.1057 1.0848 1.0884 1.0889 1.0899 1.0936 1.0981 1.0948 1.0967 1.1004 1.0649
irintensity: 0.2172 0.1903 1.3105 0.8804 0.2347 0.3924 0.2483 0.8626 0.1636 4.0967 0.4485 1.2828 0.0589 3.3132 2.5955 5.0544 10.7027 3.7601 18.9653 28.3362 20.9061 3.7282 2.2473 49.6321 11.7720 3.8744 19.6496 3.4283 0.3026 11.3854 0.0699 3.1441 9.7830 6.6946 39.5102 16.9663 12.4477 81.9575 28.8902 4.8907 0.1188 3.0823 13.1242 2.2086 2.4357 15.7962 19.0245 0.0755 4.4579 2.8876 10.0705 4.8593 5.6652 78.7479 0.6518 0.8371 5.6951 7.7662 4.1601 7.4941 5.7912 286.0422 0.6708 77.7683 2.0555 13.3989 73.4069 5.4967 31.0958 9.5355 18.5280 1.0429 0.2044 1.5666 3.7969 1.9558 47.6074 13.1383 17.1506 1.3382 28.5117 13.6849 13.1770 28.9726 37.6410 4.0105 2.9241 21.7151 11.8240 8.7043 11.9411 36.0842 0.3136 64.6318 71.7866 32.9164 28.4100 10.4685 11.3053 42.3350 38.1757 14.3625 28.6705 1.6553 0.0959 11.3642 11.6407 12.8842 28.7030 17.8183 10.4242 7.6292 18.2899 62.7911
temp: 298.150 k
press: 1.00000 atm
elementType: 8 8 8 7 6 6 6 6 6 6 6 6 6 6 6 6 6 6 6 6 6 1 1 1 1 1 1 1 1 1 1 1 1 1 1 1 1 1 1 1
symmnumber: 1
zpe: 845059.6 jmol-1
zpe.correction: 0.321866 hartree
zpe.thermalcorrener: 0.341924 hartree
zpe.thermalcorrenthalpy: 0.342868 hartree
zpe.thermalcorrgfe: 0.271089 hartree
zpe.sumelectzpe: -938.089118 hartree
zpe.sumelectthermal: -938.069060 hartree
zpe.sumelectthermalent: -938.068116 hartree
zpe.sumelectthermalfe: -938.139895 hartree
dipole: 1.4300 2.2779 -1.5641
dipole: 3.1113
quadrupole: -121.6439 -115.7474 -124.5316
quadrupole: 7.8533 1.4132 4.3389
quadrupole: -1.0029 4.8935 -3.8906 7.8533 1.4132 4.3389
hfenergy: -938.410984 hartree
pointgroup: C01 [X(C17H19N1O3)]
dipole: -0.5455907 0.9211711 0.5933998 debye
polarizability: 209.568996|1.2259057|215.928741|-1.573187|-0.6467191|143.6353121 unknown
InChI: InChI=1S/C17H19NO3/c1-13(2)17(20,14-8-4-3-5-9-14)16(19)21-12-15-10-6-7-11-18-15/h3-11,13,20H,12H2,1-2H3
charge 0 multiplicity 1
40 atoms
O  2.500997 -1.175469 -1.322118
O  -0.616882 -1.320593 0.597829
O  -0.082814 -1.748301 -1.628637
N  -4.227397 -0.911246 -0.190905
C  1.691162 -0.917391 -0.13166
C  2.269859 -1.773307 1.054328
C  1.693578 0.597362 0.190023
C  2.158787 -3.285075 0.756895
C  3.736079 -1.373235 1.330146
C  0.248336 -1.366734 -0.47871
C  1.057111 1.108134 1.351501
C  2.367389 1.492611 -0.674716
C  1.094333 2.491024 1.63712
C  2.401788 2.876451 -0.388731
C  -2.026063 -1.732902 0.35338
C  1.765714 3.382447 0.767496
C  -2.919169 -0.555904 -0.006952
C  -2.455064 0.772521 -0.13717
C  -3.387142 1.777178 -0.485212
C  -5.112443 0.069804 -0.523238
C  -4.740668 1.424874 -0.684934
H  1.655573 -1.538959 1.94545
H  2.580304 -3.867378 1.595912
H  1.110134 -3.610219 0.620334
H  2.72475 -3.538279 -0.156761
H  4.352053 -1.545561 0.430422
H  4.144105 -1.983729 2.156362
H  3.825766 -0.30945 1.611604
H  0.52438 0.431827 2.027978
H  2.872269 1.083654 -1.554088
H  1.882486 -1.479705 -2.044144
H  0.600431 2.870687 2.538844
H  2.930442 3.556609 -1.066278
H  -2.352991 -2.189101 1.301007
H  -2.054351 -2.485478 -0.453965
H  1.795167 4.454826 0.99128
H  -1.402724 1.015217 0.033599
H  -3.057738 2.815454 -0.59764
H  -6.151241 -0.250676 -0.663164
H  -5.490805 2.173812 -0.956989
