program: Orca
programVersion: 5.0.2
elementType: Cl S S P O O O O N C C C C C C C C C C C C H H H H H H H H H H H H H H H
charge: 0
multiplicity: 1
keywords: wb97x-d3
keywords: def2-TZVPP
keywords: def2/J RIJCOSX
keywords: DEFGRID2
keywords: scfconv7
keywords: smallprint printgap noloewdin
keywords: NOSOSCF
formula: C12H15ClNO4PS2
InChI: InChI=1/C12H15ClNO4PS2/c1-3-16-19(20,17-4-2)21-8-14-10-6-5-9(13)7-11(10)18-12(14)15/h5-7H,3-4,8H2,1-2H3
36 atoms
Cl 4.791132 0.136747 2.199664
S  -2.066558 0.417245 -1.779532
S  -0.85021 -2.598397 -0.67962
P  -1.75941 -0.958265 -0.239597
O  1.199056 2.892969 -0.231275
O  -3.253909 -1.089067 0.312118
O  -1.072322 -0.043304 0.871522
O  -0.484986 3.365257 -1.652547
N  0.514696 1.281057 -1.570535
C  1.5319 0.749675 -0.791405
C  -0.37308 0.584304 -2.449432
C  1.938338 1.781547 0.039047
C  0.312363 2.585615 -1.214028
C  2.143259 -0.483717 -0.733265
C  2.934137 1.65148 0.973836
C  3.158012 -0.649647 0.204923
C  3.532552 0.395467 1.038215
C  -4.227155 -1.987498 -0.259409
C  -0.32253 -0.594629 1.976342
C  -5.154369 -2.448669 0.834764
C  -1.208721 -1.257758 3.001808
H  -0.489488 1.128989 -3.385732
H  0.03742 -0.396413 -2.681034
H  1.852864 -1.302562 -1.37522
H  3.230114 2.469871 1.615749
H  3.654763 -1.606969 0.280624
H  -4.772476 -1.451042 -1.038184
H  -3.722339 -2.837759 -0.723072
H  0.426749 -1.290032 1.594154
H  0.19853 0.260046 2.404792
H  -5.673681 -1.612867 1.304255
H  -5.907556 -3.11162 0.407943
H  -4.616704 -3.004123 1.60367
H  -1.678516 -2.16367 2.616937
H  -0.598525 -1.545203 3.859065
H  -1.987668 -0.583464 3.358076
elementType: Cl S P O N C H
totalener: -2420.16325390 hartree
nucrepener: 2477.52852722 hartree
electener: -4897.69178113 hartree
oneelecener: -8260.65609683 hartree
twoeener: 3362.96431571 hartree
cpcmener: -0.02711983 hartree
kineticenergy: 2413.97815611 hartree
xcener: -154.010665980897 hartree
chargesum: 0.0000000
charge: -0.092037 -0.141333 -0.438113 0.629869 -0.251937 -0.351654 -0.328151 -0.426782 -0.059547 0.008506 -0.064136 0.255400 0.414056 -0.193157 -0.223161 -0.157853 0.140381 0.040840 0.034220 -0.238614 -0.242971 0.167631 0.151359 0.142858 0.144873 0.140838 0.103422 0.088816 0.095454 0.113178 0.090732 0.090745 0.086112 0.077141 0.098482 0.094533
qa: -0.0920 -0.1413 -0.4381 0.6299 -0.2519 -0.3517 -0.3282 -0.4268 -0.0595 0.0085 -0.0641 0.2554 0.4141 -0.1932 -0.2232 -0.1579 0.1404 0.0408 0.0342 -0.2386 -0.2430 0.1676 0.1514 0.1429 0.1449 0.1408 0.1034 0.0888 0.0955 0.1132 0.0907 0.0907 0.0861 0.0771 0.0985 0.0945
va: 1.2079 2.2838 2.0035 5.4474 2.2108 2.1174 2.0823 2.0946 3.1878 3.7792 3.9129 3.8074 4.3537 3.9439 4.0950 4.0082 3.7941 3.8420 3.8204 3.9509 3.9543 0.9938 1.0139 1.0170 1.0124 1.0075 0.9925 1.0098 1.0043 0.9840 1.0037 1.0074 1.0059 1.0160 1.0078 1.0057
dispcorr: -0.022168260 hartree
energy: -2420.185422163351
dipole: -23.70564 23.63946 -0.06618 -14.91426 13.22727 -1.68699 6.54971 -6.45488 0.09484
magnitude: 1.69095 au
magnitude: 4.29806 debye
