program: Orca
programVersion: 5.0.2
elementType: Cl S S P O O O O N C C C C C C C C C C C C H H H H H H H H H H H H H H H
charge: 0
multiplicity: 1
keywords: wb97x-d3
keywords: def2-TZVPP
keywords: def2/J RIJCOSX
keywords: DEFGRID2
keywords: scfconv7
keywords: smallprint printgap noloewdin
keywords: NOSOSCF
formula: C12H15ClNO4PS2
InChI: InChI=1/C12H15ClNO4PS2/c1-3-16-19(20,17-4-2)21-8-14-10-6-5-9(13)7-11(10)18-12(14)15/h5-7H,3-4,8H2,1-2H3
36 atoms
Cl 4.98431 -2.112602 0.475995
S  -1.986893 1.216876 -0.659777
S  -1.647715 0.554835 2.66948
P  -2.104909 -0.146816 0.936334
O  2.139573 1.047308 -2.409819
O  -1.238355 -1.424693 0.565354
O  -3.597997 -0.676948 0.729193
O  0.452252 2.430819 -2.974655
N  0.718219 1.620294 -0.824157
C  1.624461 0.739741 -0.250245
C  -0.471501 2.163919 -0.25287
C  2.506123 0.404701 -1.26532
C  1.025236 1.77752 -2.148502
C  1.769424 0.205395 1.01214
C  3.5563 -0.461858 -1.099859
C  2.824829 -0.679366 1.213972
C  3.690706 -1.000637 0.177719
C  -1.394256 -2.179017 -0.660855
C  -4.750933 0.134419 1.039199
C  -0.155178 -2.067465 -1.51054
C  -5.898685 -0.778684 1.378879
H  -0.369992 2.241762 0.829042
H  -0.638763 3.16583 -0.643834
H  1.094447 0.444729 1.822242
H  4.228588 -0.711342 -1.909124
H  2.963588 -1.119516 2.19176
H  -1.569311 -3.20937 -0.352222
H  -2.274274 -1.850415 -1.216918
H  -4.522803 0.79756 1.876864
H  -4.984253 0.752755 0.170602
H  0.744564 -2.326576 -0.951479
H  -0.23966 -2.763771 -2.346072
H  -0.040009 -1.067887 -1.92805
H  -5.686387 -1.374982 2.266371
H  -6.783336 -0.175313 1.584089
H  -6.13782 -1.44976 0.553532
elementType: Cl S P O N C H
totalener: -2420.16537681 hartree
nucrepener: 2447.29826148 hartree
electener: -4867.46363829 hartree
oneelecener: -8199.69630186 hartree
twoeener: 3332.23266357 hartree
cpcmener: -0.02653252 hartree
kineticenergy: 2413.94750197 hartree
xcener: -154.004994949971 hartree
chargesum: -0.0000000
charge: -0.092217 -0.159830 -0.428044 0.628944 -0.252616 -0.322308 -0.345805 -0.431628 -0.048254 0.049457 -0.073901 0.200268 0.424220 -0.238287 -0.178293 -0.126302 0.098280 0.016751 0.037056 -0.205828 -0.240523 0.160483 0.164041 0.154489 0.145543 0.141321 0.110470 0.097724 0.094649 0.102054 0.082748 0.109220 0.060365 0.087832 0.088429 0.089494
qa: -0.0922 -0.1598 -0.4280 0.6289 -0.2526 -0.3223 -0.3458 -0.4316 -0.0483 0.0495 -0.0739 0.2003 0.4242 -0.2383 -0.1783 -0.1263 0.0983 0.0168 0.0371 -0.2058 -0.2405 0.1605 0.1640 0.1545 0.1455 0.1413 0.1105 0.0977 0.0946 0.1021 0.0827 0.1092 0.0604 0.0878 0.0884 0.0895
va: 1.2063 2.2603 2.0330 5.4448 2.2041 2.1001 2.1108 2.0899 3.1876 3.7503 3.8873 3.8307 4.3234 3.9678 4.0733 4.0230 3.8377 3.8885 3.8398 3.9043 3.9705 1.0165 0.9997 1.0247 1.0110 1.0062 0.9965 0.9979 1.0053 0.9930 1.0039 1.0109 1.0107 1.0066 1.0064 1.0034
dispcorr: -0.021909426 hartree
energy: -2420.187286236790
dipole: -27.34510 26.15444 -1.19066 -4.92368 4.33582 -0.58786 0.00650 0.19441 0.20091
magnitude: 1.34299 au
magnitude: 3.41360 debye
