program: Orca
programVersion: 5.0.2
elementType: Cl S S P O O O O N C C C C C C C C C C C C H H H H H H H H H H H H H H H
charge: 0
multiplicity: 1
keywords: wb97x-d3
keywords: def2-TZVPP
keywords: def2/J RIJCOSX
keywords: DEFGRID2
keywords: scfconv7
keywords: smallprint printgap noloewdin
keywords: NOSOSCF
formula: C12H15ClNO4PS2
InChI: InChI=1/C12H15ClNO4PS2/c1-3-16-19(20,17-4-2)21-8-14-10-6-5-9(13)7-11(10)18-12(14)15/h5-7H,3-4,8H2,1-2H3
36 atoms
Cl 4.716033 -2.268215 0.430203
S  -1.937985 1.945412 -0.52955
S  -1.458262 0.178268 2.358443
P  -1.941279 0.125397 0.49371
O  1.825946 0.844971 -2.46167
O  -1.035381 -0.779398 -0.457814
O  -3.417475 -0.372665 0.140323
O  0.284243 2.407814 -2.975893
N  0.775027 1.828691 -0.791821
C  1.644041 0.90521 -0.229667
C  -0.263521 2.566683 -0.140946
C  2.289599 0.30712 -1.299556
C  0.883638 1.774749 -2.153783
C  1.947236 0.547308 1.065715
C  3.241063 -0.670852 -1.15649
C  2.907292 -0.444128 1.246092
C  3.530988 -1.035286 0.155969
C  -0.442956 -2.019527 -0.015735
C  -4.56683 0.010547 0.927415
C  -1.462433 -3.121109 0.140513
C  -5.0030 -1.120954 1.821287
H  -0.099602 2.556587 0.93471
H  -0.259493 3.604911 -0.469912
H  1.460909 0.999127 1.917943
H  3.72954 -1.1257 -2.007285
H  3.164649 -0.75273 2.249808
H  0.281998 -2.266433 -0.789519
H  0.100789 -1.849853 0.915324
H  -4.351994 0.90722 1.511901
H  -5.343434 0.266676 0.208452
H  -0.939875 -4.055122 0.35139
H  -2.14792 -2.935444 0.96844
H  -2.043839 -3.263435 -0.770609
H  -5.220557 -2.021462 1.24847
H  -4.246106 -1.355535 2.568547
H  -5.914452 -0.830496 2.345016
elementType: Cl S P O N C H
totalener: -2420.16269626 hartree
nucrepener: 2485.88649515 hartree
electener: -4906.04919141 hartree
oneelecener: -8277.37336499 hartree
twoeener: 3371.32417358 hartree
cpcmener: -0.02696651 hartree
kineticenergy: 2413.98863283 hartree
xcener: -154.013387462734 hartree
chargesum: -0.0000000
charge: -0.092171 -0.139004 -0.439414 0.630637 -0.251895 -0.328074 -0.356211 -0.426754 -0.059813 0.003002 -0.063979 0.256065 0.413637 -0.188930 -0.221667 -0.158631 0.140455 0.032298 0.047202 -0.243418 -0.248289 0.150199 0.168217 0.142522 0.144216 0.140227 0.112920 0.094726 0.088047 0.110520 0.099009 0.077992 0.095207 0.091455 0.079116 0.100579
qa: -0.0922 -0.1390 -0.4394 0.6306 -0.2519 -0.3281 -0.3562 -0.4268 -0.0598 0.0030 -0.0640 0.2561 0.4136 -0.1889 -0.2217 -0.1586 0.1405 0.0323 0.0472 -0.2434 -0.2483 0.1502 0.1682 0.1425 0.1442 0.1402 0.1129 0.0947 0.0880 0.1105 0.0990 0.0780 0.0952 0.0915 0.0791 0.1006
va: 1.2077 2.2859 1.9957 5.4446 2.2102 2.0862 2.1008 2.0947 3.1904 3.7838 3.9106 3.8055 4.3539 3.9457 4.0942 4.0111 3.7935 3.8268 3.8394 3.9552 3.9289 1.0152 0.9942 1.0169 1.0125 1.0077 0.9839 1.0049 1.0106 0.9945 1.0084 1.0110 1.0052 1.0025 1.0157 1.0095
dispcorr: -0.022606851 hartree
energy: -2420.185303107318
dipole: -25.20269 24.73930 -0.46339 -8.81225 8.30119 -0.51106 9.27825 -7.66629 1.61196
magnitude: 1.75337 au
magnitude: 4.45672 debye
