program: Orca
programVersion: 5.0.2
elementType: Cl S S P O O O O N C C C C C C C C C C C C H H H H H H H H H H H H H H H
charge: 0
multiplicity: 1
keywords: wb97x-d3
keywords: def2-TZVPP
keywords: def2/J RIJCOSX
keywords: DEFGRID2
keywords: scfconv7
keywords: smallprint printgap noloewdin
keywords: NOSOSCF
formula: C12H15ClNO4PS2
InChI: InChI=1/C12H15ClNO4PS2/c1-3-16-19(20,17-4-2)21-8-14-10-6-5-9(13)7-11(10)18-12(14)15/h5-7H,3-4,8H2,1-2H3
36 atoms
Cl 4.817985 0.164041 2.187047
S  -2.060996 0.529189 -1.728497
S  -0.969337 -2.568543 -0.763819
P  -1.796834 -0.909115 -0.237841
O  1.319611 2.958127 -0.335286
O  -3.291338 -0.989718 0.32073
O  -1.053837 -0.066725 0.892855
O  -0.366592 3.433753 -1.753675
N  0.545992 1.315587 -1.585685
C  1.545189 0.775712 -0.78971
C  -0.377095 0.624903 -2.432263
C  2.011101 1.828347 -0.018366
C  0.405329 2.642989 -1.28982
C  2.09569 -0.481888 -0.671596
C  3.013706 1.699061 0.909167
C  3.115048 -0.64768 0.261654
C  3.553612 0.421055 1.031555
C  -4.306935 -1.789795 -0.324845
C  -0.364051 -0.680452 2.003627
C  -4.609931 -3.017419 0.494866
C  -1.318431 -1.194324 3.053289
H  -0.489693 1.150383 -3.379867
H  -0.002904 -0.374335 -2.646801
H  1.753785 -1.319235 -1.262641
H  3.358176 2.534504 1.503043
H  3.564923 -1.623266 0.383354
H  -5.18136 -1.14544 -0.412359
H  -3.996538 -2.063681 -1.336062
H  0.284503 -1.477365 1.635028
H  0.268206 0.11063 2.404064
H  -5.41839 -3.573833 0.019119
H  -3.74415 -3.675942 0.564356
H  -4.933431 -2.75588 1.502841
H  -0.743563 -1.527944 3.918087
H  -2.003363 -0.415309 3.388443
H  -1.901853 -2.045268 2.699608
elementType: Cl S P O N C H
totalener: -2420.16333345 hartree
nucrepener: 2473.60166668 hartree
electener: -4893.76500013 hartree
oneelecener: -8252.76158492 hartree
twoeener: 3358.99658479 hartree
cpcmener: -0.02676650 hartree
kineticenergy: 2413.97543769 hartree
xcener: -154.009889708933 hartree
chargesum: 0.0000000
charge: -0.092527 -0.138647 -0.439873 0.628118 -0.251937 -0.354975 -0.329282 -0.428514 -0.056808 0.015037 -0.064669 0.246234 0.415273 -0.207176 -0.212467 -0.145571 0.128124 0.044815 0.034453 -0.244464 -0.240438 0.167567 0.151273 0.146748 0.145426 0.141371 0.110986 0.088058 0.095513 0.109307 0.098819 0.078092 0.091370 0.098362 0.094118 0.078285
qa: -0.0925 -0.1386 -0.4399 0.6281 -0.2519 -0.3550 -0.3293 -0.4285 -0.0568 0.0150 -0.0647 0.2462 0.4153 -0.2072 -0.2125 -0.1456 0.1281 0.0448 0.0345 -0.2445 -0.2404 0.1676 0.1513 0.1467 0.1454 0.1414 0.1110 0.0881 0.0955 0.1093 0.0988 0.0781 0.0914 0.0984 0.0941 0.0783
va: 1.2071 2.2844 1.9975 5.4510 2.2134 2.1019 2.0857 2.0925 3.1935 3.7749 3.9057 3.8329 4.3524 3.9382 4.0986 4.0040 3.8069 3.8417 3.8274 3.9348 3.9554 0.9949 1.0157 1.0171 1.0120 1.0068 0.9940 1.0100 1.0061 0.9843 1.0092 1.0159 1.0025 1.0080 1.0050 1.0113
dispcorr: -0.022155261 hartree
energy: -2420.185488714985
dipole: -23.11820 22.94925 -0.16894 -16.33565 14.60467 -1.73099 6.07911 -5.89211 0.18700
magnitude: 1.74924 au
magnitude: 4.44620 debye
