program: Orca
programVersion: 5.0.2
elementType: Cl S S P O O O O N C C C C C C C C C C C C H H H H H H H H H H H H H H H
charge: 0
multiplicity: 1
keywords: wb97x-d3
keywords: def2-TZVPP
keywords: def2/J RIJCOSX
keywords: DEFGRID2
keywords: scfconv7
keywords: smallprint printgap noloewdin
keywords: NOSOSCF
formula: C12H15ClNO4PS2
InChI: InChI=1/C12H15ClNO4PS2/c1-3-16-19(20,17-4-2)21-8-14-10-6-5-9(13)7-11(10)18-12(14)15/h5-7H,3-4,8H2,1-2H3
36 atoms
Cl 5.566582 0.146945 1.290108
S  -0.963153 -1.468363 -1.430975
S  -2.888541 -2.372457 1.041017
P  -2.083201 -0.834958 0.217624
O  1.090982 2.385864 0.106237
O  -3.030815 0.327706 -0.321936
O  -1.128614 0.083665 1.107512
O  -0.91233 2.685842 -0.876058
N  0.456687 0.878549 -1.372095
C  1.694347 0.480011 -0.899038
C  -0.409547 0.104865 -2.200032
C  2.06934 1.441713 0.024027
C  0.084549 2.035492 -0.73939
C  2.505097 -0.60035 -1.17033
C  3.248275 1.392633 0.723427
C  3.708479 -0.681659 -0.474676
C  4.061173 0.294392 0.447416
C  -4.110852 0.050482 -1.238424
C  -0.521141 -0.366124 2.336994
C  -5.436996 0.127512 -0.526136
C  0.578963 -1.375635 2.12691
H  -1.262576 0.708696 -2.499609
H  0.111894 -0.205072 -3.106333
H  2.234103 -1.365038 -1.884808
H  3.523905 2.152592 1.441791
H  4.370041 -1.517139 -0.656837
H  -4.038593 0.806007 -2.020323
H  -3.977399 -0.925738 -1.711771
H  -0.132446 0.542705 2.793444
H  -1.296782 -0.764569 2.993247
H  -6.240552 -0.011604 -1.250139
H  -5.529842 -0.648686 0.233252
H  -5.57929 1.099184 -0.052581
H  1.03101 -1.601707 3.093688
H  0.204403 -2.311907 1.713433
H  1.365413 -0.995259 1.475873
elementType: Cl S P O N C H
totalener: -2420.16438245 hartree
nucrepener: 2492.54526751 hartree
electener: -4912.70964997 hartree
oneelecener: -8290.78824073 hartree
twoeener: 3378.07859076 hartree
cpcmener: -0.03106180 hartree
kineticenergy: 2413.96795490 hartree
xcener: -154.012029322936 hartree
chargesum: -0.0000000
charge: -0.090900 -0.157336 -0.426567 0.608704 -0.253074 -0.327944 -0.331789 -0.425143 -0.058733 0.012616 -0.068178 0.208109 0.398790 -0.179358 -0.185225 -0.129103 0.110926 0.039664 0.034212 -0.233366 -0.230664 0.149166 0.172193 0.150653 0.146107 0.140823 0.106130 0.087581 0.108221 0.109493 0.092930 0.075228 0.090773 0.108202 0.085957 0.060902
qa: -0.0909 -0.1573 -0.4266 0.6087 -0.2531 -0.3279 -0.3318 -0.4251 -0.0587 0.0126 -0.0682 0.2081 0.3988 -0.1794 -0.1852 -0.1291 0.1109 0.0397 0.0342 -0.2334 -0.2307 0.1492 0.1722 0.1507 0.1461 0.1408 0.1061 0.0876 0.1082 0.1095 0.0929 0.0752 0.0908 0.1082 0.0860 0.0609
va: 1.2085 2.2503 2.0353 5.4748 2.1966 2.1087 2.1034 2.0930 3.1832 3.8178 3.9051 3.8393 4.3548 3.9772 4.0802 3.9928 3.8294 3.8515 3.8123 3.9566 3.8962 1.0135 0.9840 1.0040 1.0112 1.0069 0.9920 1.0055 0.9949 1.0126 1.0072 1.0179 1.0041 1.0125 1.0248 1.0053
dispcorr: -0.023180704 hartree
energy: -2420.187563157948
dipole: -20.68285 21.62302 0.94017 -3.53048 3.08437 -0.44610 -1.47463 0.03038 -1.44426
magnitude: 1.78012 au
magnitude: 4.52470 debye
